BDBM50168600 4-(1H-Imidazo[4,5-c]pyridin-2-yl)-furazan-3-ylamine::CHEMBL361690
SMILES: Nc1nonc1-c1nc2ccncc2[nH]1
InChI Key: InChIKey=SJXNGQHATFCKCB-UHFFFAOYSA-N
Data: 1 IC50
Activity Spreadsheet -- Enzyme Inhibition Constant Data from BindingDB
Found 1 hit for monomerid = 50168600
Trg + Lig
Ki
nM
ΔG°
kcal/mole
IC50
nM
Kd
nM
EC50/IC50
nM
koff
s-1
kon
M-1s-1
pHTemp
°C
Ribosomal protein S6 kinase alpha 5
(Homo sapiens (Human))
BDBM50168600
(4-(1H-Imidazo[4,5-c]pyridin-2-yl)-furazan-3-ylamin...)
Show SMILES Nc1nonc1-c1nc2ccncc2[nH]1
Show InChI InChI=1S/C8H6N6O/c9-7-6(13-15-14-7)8-11-4-1-2-10-3-5(4)12-8/h1-3H,(H2,9,14)(H,11,12)
NCI pathway
Reactome pathway
n/an/a 1.96E+3n/an/an/an/an/an/a
GlaxoSmithKline Pharmaceuticals
Curated by ChEMBL
Assay Description
Inhibitory concentration exhibited towards MSK-1
Bioorg Med Chem Lett 15: 3402-6 (2005)
Article DOI: 10.1016/j.bmcl.2005.05.021
BindingDB Entry DOI: 10.7270/Q2Z037P9