BDBM50168743 (2R,3R)-1-[4-(3-Fluoro-2-methyl-benzyloxy)-benzenesulfonyl]-3-hydroxy-3-methyl-piperidine-2-carboxylic acid hydroxyamide::CHEMBL363126
SMILES: Cc1c(F)cccc1COc1ccc(cc1)S(=O)(=O)N1CCC[C@@](C)(O)[C@@H]1C(=O)NO
InChI Key: InChIKey=NOBVVTLEQRHRBY-PZJWPPBQSA-N
Data: 4 IC50
Activity Spreadsheet -- Enzyme Inhibition Constant Data from BindingDB
Found 4 hits for monomerid = 50168743
Trg + Lig
Ki
nM
ΔG°
kcal/mole
IC50
nM
Kd
nM
EC50/IC50
nM
koff
s-1
kon
M-1s-1
pHTemp
°C
Disintegrin and metalloproteinase domain-containing protein 17
(Homo sapiens (Human))
BDBM50168743
((2R,3R)-1-[4-(3-Fluoro-2-methyl-benzyloxy)-benzene...)
Show SMILES Cc1c(F)cccc1COc1ccc(cc1)S(=O)(=O)N1CCC[C@@](C)(O)[C@@H]1C(=O)NO
Show InChI InChI=1S/C21H25FN2O6S/c1-14-15(5-3-6-18(14)22)13-30-16-7-9-17(10-8-16)31(28,29)24-12-4-11-21(2,26)19(24)20(25)23-27/h3,5-10,19,26-27H,4,11-13H2,1-2H3,(H,23,25)/t19-,21+/m0/s1
Reactome pathway
n/an/a 1.60n/an/an/an/an/an/a
Pfizer Global Research and Development
Curated by ChEMBL
Assay Description
Inhibitory concentration against TNF-alpha release in LPS treated whole blood
Bioorg Med Chem Lett 15: 3385-8 (2005)
Article DOI: 10.1016/j.bmcl.2005.05.037
BindingDB Entry DOI: 10.7270/Q25D8RCC
Interstitial collagenase
(Homo sapiens (Human))
BDBM50168743
((2R,3R)-1-[4-(3-Fluoro-2-methyl-benzyloxy)-benzene...)
Show SMILES Cc1c(F)cccc1COc1ccc(cc1)S(=O)(=O)N1CCC[C@@](C)(O)[C@@H]1C(=O)NO
Show InChI InChI=1S/C21H25FN2O6S/c1-14-15(5-3-6-18(14)22)13-30-16-7-9-17(10-8-16)31(28,29)24-12-4-11-21(2,26)19(24)20(25)23-27/h3,5-10,19,26-27H,4,11-13H2,1-2H3,(H,23,25)/t19-,21+/m0/s1
Reactome pathway
n/an/a 1.29E+3n/an/an/an/an/an/a
Pomona College
Curated by ChEMBL
Assay Description
Inhibition of MMP1
Bioorg Med Chem 15: 2223-68 (2007)
Article DOI: 10.1016/j.bmc.2007.01.011
BindingDB Entry DOI: 10.7270/Q2571DBD
Interstitial collagenase
(Homo sapiens (Human))
BDBM50168743
((2R,3R)-1-[4-(3-Fluoro-2-methyl-benzyloxy)-benzene...)
Show SMILES Cc1c(F)cccc1COc1ccc(cc1)S(=O)(=O)N1CCC[C@@](C)(O)[C@@H]1C(=O)NO
Show InChI InChI=1S/C21H25FN2O6S/c1-14-15(5-3-6-18(14)22)13-30-16-7-9-17(10-8-16)31(28,29)24-12-4-11-21(2,26)19(24)20(25)23-27/h3,5-10,19,26-27H,4,11-13H2,1-2H3,(H,23,25)/t19-,21+/m0/s1
Reactome pathway
n/an/a 1.30E+3n/an/an/an/an/an/a
Pfizer Global Research and Development
Curated by ChEMBL
Assay Description
Inhibitory concentration against MMP-1
Bioorg Med Chem Lett 15: 3385-8 (2005)
Article DOI: 10.1016/j.bmcl.2005.05.037
BindingDB Entry DOI: 10.7270/Q25D8RCC
ADAM17
(Rattus norvegicus)
BDBM50168743
((2R,3R)-1-[4-(3-Fluoro-2-methyl-benzyloxy)-benzene...)
Show SMILES Cc1c(F)cccc1COc1ccc(cc1)S(=O)(=O)N1CCC[C@@](C)(O)[C@@H]1C(=O)NO
Show InChI InChI=1S/C21H25FN2O6S/c1-14-15(5-3-6-18(14)22)13-30-16-7-9-17(10-8-16)31(28,29)24-12-4-11-21(2,26)19(24)20(25)23-27/h3,5-10,19,26-27H,4,11-13H2,1-2H3,(H,23,25)/t19-,21+/m0/s1
n/an/a 10n/an/an/an/an/an/a
Pfizer Global Research and Development
Curated by ChEMBL
Assay Description
Inhibitory concentration of the compound against rat TACE
Bioorg Med Chem Lett 15: 3385-8 (2005)
Article DOI: 10.1016/j.bmcl.2005.05.037
BindingDB Entry DOI: 10.7270/Q25D8RCC