BDBM50168752 (2R,3R)-3-Hydroxy-3-methyl-1-[4-(2-methyl-benzyloxy)-benzenesulfonyl]-piperidine-2-carboxylic acid hydroxyamide::CHEMBL186663
SMILES: Cc1ccccc1COc1ccc(cc1)S(=O)(=O)N1CCC[C@@](C)(O)[C@@H]1C(=O)NO
InChI Key: InChIKey=FYNYGUYHKZWCAU-PZJWPPBQSA-N
Data: 3 IC50
Activity Spreadsheet -- Enzyme Inhibition Constant Data from BindingDB
Found 3 hits for monomerid = 50168752
Trg + Lig
Ki
nM
ΔG°
kcal/mole
IC50
nM
Kd
nM
EC50/IC50
nM
koff
s-1
kon
M-1s-1
pHTemp
°C
Disintegrin and metalloproteinase domain-containing protein 17
(Homo sapiens (Human))
BDBM50168752
((2R,3R)-3-Hydroxy-3-methyl-1-[4-(2-methyl-benzylox...)
Show SMILES Cc1ccccc1COc1ccc(cc1)S(=O)(=O)N1CCC[C@@](C)(O)[C@@H]1C(=O)NO
Show InChI InChI=1S/C21H26N2O6S/c1-15-6-3-4-7-16(15)14-29-17-8-10-18(11-9-17)30(27,28)23-13-5-12-21(2,25)19(23)20(24)22-26/h3-4,6-11,19,25-26H,5,12-14H2,1-2H3,(H,22,24)/t19-,21+/m0/s1
Reactome pathway
n/an/a 2.20n/an/an/an/an/an/a
Pfizer Global Research and Development
Curated by ChEMBL
Assay Description
Inhibitory concentration against TNF-alpha release in LPS treated whole blood
Bioorg Med Chem Lett 15: 3385-8 (2005)
Article DOI: 10.1016/j.bmcl.2005.05.037
BindingDB Entry DOI: 10.7270/Q25D8RCC
Interstitial collagenase
(Homo sapiens (Human))
BDBM50168752
((2R,3R)-3-Hydroxy-3-methyl-1-[4-(2-methyl-benzylox...)
Show SMILES Cc1ccccc1COc1ccc(cc1)S(=O)(=O)N1CCC[C@@](C)(O)[C@@H]1C(=O)NO
Show InChI InChI=1S/C21H26N2O6S/c1-15-6-3-4-7-16(15)14-29-17-8-10-18(11-9-17)30(27,28)23-13-5-12-21(2,25)19(23)20(24)22-26/h3-4,6-11,19,25-26H,5,12-14H2,1-2H3,(H,22,24)/t19-,21+/m0/s1
Reactome pathway
n/an/a 309n/an/an/an/an/an/a
Pomona College
Curated by ChEMBL
Assay Description
Inhibition of MMP1
Bioorg Med Chem 15: 2223-68 (2007)
Article DOI: 10.1016/j.bmc.2007.01.011
BindingDB Entry DOI: 10.7270/Q2571DBD
Interstitial collagenase
(Homo sapiens (Human))
BDBM50168752
((2R,3R)-3-Hydroxy-3-methyl-1-[4-(2-methyl-benzylox...)
Show SMILES Cc1ccccc1COc1ccc(cc1)S(=O)(=O)N1CCC[C@@](C)(O)[C@@H]1C(=O)NO
Show InChI InChI=1S/C21H26N2O6S/c1-15-6-3-4-7-16(15)14-29-17-8-10-18(11-9-17)30(27,28)23-13-5-12-21(2,25)19(23)20(24)22-26/h3-4,6-11,19,25-26H,5,12-14H2,1-2H3,(H,22,24)/t19-,21+/m0/s1
Reactome pathway
n/an/a 310n/an/an/an/an/an/a
Pfizer Global Research and Development
Curated by ChEMBL
Assay Description
Inhibitory concentration against MMP-1
Bioorg Med Chem Lett 15: 3385-8 (2005)
Article DOI: 10.1016/j.bmcl.2005.05.037
BindingDB Entry DOI: 10.7270/Q25D8RCC