BDBM50168758 (2R,3S)-3-Ethyl-1-[4-(4-fluoro-benzyloxy)-benzenesulfonyl]-3-hydroxy-piperidine-2-carboxylic acid hydroxyamide::CHEMBL435102
SMILES: CC[C@]1(O)CCCN([C@H]1C(=O)NO)S(=O)(=O)c1ccc(OCc2ccc(F)cc2)cc1
InChI Key: InChIKey=CUXTVWWELMBPKU-FPOVZHCZSA-N
Data: 2 IC50
Activity Spreadsheet -- Enzyme Inhibition Constant Data from BindingDB
Found 2 hits for monomerid = 50168758
Trg + Lig
Ki
nM
ΔG°
kcal/mole
IC50
nM
Kd
nM
EC50/IC50
nM
koff
s-1
kon
M-1s-1
pHTemp
°C
ADAM17
(Rattus norvegicus)
BDBM50168758
((2R,3S)-3-Ethyl-1-[4-(4-fluoro-benzyloxy)-benzenes...)
Show SMILES CC[C@]1(O)CCCN([C@H]1C(=O)NO)S(=O)(=O)c1ccc(OCc2ccc(F)cc2)cc1
Show InChI InChI=1S/C21H25FN2O6S/c1-2-21(26)12-3-13-24(19(21)20(25)23-27)31(28,29)18-10-8-17(9-11-18)30-14-15-4-6-16(22)7-5-15/h4-11,19,26-27H,2-3,12-14H2,1H3,(H,23,25)/t19-,21-/m0/s1
n/an/a 1.70n/an/an/an/an/an/a
Pfizer Global Research and Development
Curated by ChEMBL
Assay Description
Inhibitory concentration of the compound against rat TACE
Bioorg Med Chem Lett 15: 3385-8 (2005)
Article DOI: 10.1016/j.bmcl.2005.05.037
BindingDB Entry DOI: 10.7270/Q25D8RCC
Interstitial collagenase
(Homo sapiens (Human))
BDBM50168758
((2R,3S)-3-Ethyl-1-[4-(4-fluoro-benzyloxy)-benzenes...)
Show SMILES CC[C@]1(O)CCCN([C@H]1C(=O)NO)S(=O)(=O)c1ccc(OCc2ccc(F)cc2)cc1
Show InChI InChI=1S/C21H25FN2O6S/c1-2-21(26)12-3-13-24(19(21)20(25)23-27)31(28,29)18-10-8-17(9-11-18)30-14-15-4-6-16(22)7-5-15/h4-11,19,26-27H,2-3,12-14H2,1H3,(H,23,25)/t19-,21-/m0/s1
Reactome pathway
n/an/a 1.10E+3n/an/an/an/an/an/a
Pfizer Global Research and Development
Curated by ChEMBL
Assay Description
Inhibitory concentration against MMP-1
Bioorg Med Chem Lett 15: 3385-8 (2005)
Article DOI: 10.1016/j.bmcl.2005.05.037
BindingDB Entry DOI: 10.7270/Q25D8RCC