BDBM50168800 1-[2-(3'-Cyano-biphenyl-4-yl)-4-dimethylamino-butyl]-3-(3-fluoro-phenyl)-urea::CHEMBL367532
SMILES: CN(C)CCC(CNC(=O)Nc1cccc(F)c1)c1ccc(cc1)-c1cccc(c1)C#N
InChI Key: InChIKey=PNDYGSWXVABTES-UHFFFAOYSA-N
Data: 1 KI  1 IC50
Activity Spreadsheet -- Enzyme Inhibition Constant Data from BindingDB
Found 2 hits for monomerid = 50168800
Trg + Lig
Ki
nM
ΔG°
kcal/mole
IC50
nM
Kd
nM
EC50/IC50
nM
koff
s-1
kon
M-1s-1
pHTemp
°C
Melanin-concentrating hormone receptor
(Homo sapiens (Human))
BDBM50168800
(1-[2-(3'-Cyano-biphenyl-4-yl)-4-dimethylamino-buty...)
Show SMILES CN(C)CCC(CNC(=O)Nc1cccc(F)c1)c1ccc(cc1)-c1cccc(c1)C#N
Show InChI InChI=1S/C26H27FN4O/c1-31(2)14-13-23(18-29-26(32)30-25-8-4-7-24(27)16-25)21-11-9-20(10-12-21)22-6-3-5-19(15-22)17-28/h3-12,15-16,23H,13-14,18H2,1-2H3,(H2,29,30,32)
Reactome pathway
1.20n/an/an/an/an/an/an/an/a
Pharmacopeia Drug Discovery, Inc.
Curated by ChEMBL
Assay Description
Inhibitiory constant towards Human melanin-concentrating hormone receptor
Bioorg Med Chem Lett 15: 3691-5 (2005)
Article DOI: 10.1016/j.bmcl.2005.05.039
BindingDB Entry DOI: 10.7270/Q2X066KC
Melanin-concentrating hormone receptor
(Homo sapiens (Human))
BDBM50168800
(1-[2-(3'-Cyano-biphenyl-4-yl)-4-dimethylamino-buty...)
Show SMILES CN(C)CCC(CNC(=O)Nc1cccc(F)c1)c1ccc(cc1)-c1cccc(c1)C#N
Show InChI InChI=1S/C26H27FN4O/c1-31(2)14-13-23(18-29-26(32)30-25-8-4-7-24(27)16-25)21-11-9-20(10-12-21)22-6-3-5-19(15-22)17-28/h3-12,15-16,23H,13-14,18H2,1-2H3,(H2,29,30,32)
Reactome pathway
n/an/a 1.20n/an/an/an/an/an/a
University of Science and Technology
Curated by ChEMBL
Assay Description
Antagonist activity at MCHR1 (unknown origin) expressed in CHO cells co-expressing aequorin incubated for 10 mins by luminescence assay
Bioorg Med Chem Lett 29: (2019)
Article DOI: 10.1016/j.bmcl.2019.126741