BDBM50168859 4-[1-(3-Amino-propyl)-1H-imidazo[4,5-c]pyridin-2-yl]-furazan-3-ylamine::CHEMBL189773
SMILES: NCCCn1c(nc2cnccc12)-c1nonc1N
InChI Key: InChIKey=LIXSYZRJBLDAGN-UHFFFAOYSA-N
Data: 1 IC50
Activity Spreadsheet -- Enzyme Inhibition Constant Data from BindingDB
Found 1 hit for monomerid = 50168859
Trg + Lig
Ki
nM
ΔG°
kcal/mole
IC50
nM
Kd
nM
EC50/IC50
nM
koff
s-1
kon
M-1s-1
pHTemp
°C
Ribosomal protein S6 kinase alpha 5
(Homo sapiens (Human))
BDBM50168859
(4-[1-(3-Amino-propyl)-1H-imidazo[4,5-c]pyridin-2-y...)
Show SMILES NCCCn1c(nc2cnccc12)-c1nonc1N
Show InChI InChI=1S/C11H13N7O/c12-3-1-5-18-8-2-4-14-6-7(8)15-11(18)9-10(13)17-19-16-9/h2,4,6H,1,3,5,12H2,(H2,13,17)
NCI pathway
Reactome pathway
n/an/a 22n/an/an/an/an/an/a
GlaxoSmithKline Pharmaceuticals
Curated by ChEMBL
Assay Description
Inhibitory concentration against MSK-1
Bioorg Med Chem Lett 15: 3407-11 (2005)
Article DOI: 10.1016/j.bmcl.2005.05.020
BindingDB Entry DOI: 10.7270/Q2S75FVN