BDBM50168999 (2R,3R,4R,5R)-5-(Benzylamino-methyl)-pyrrolidine-2,3,4-triol::CHEMBL190736
SMILES: O[C@H]1N[C@H](CNCc2ccccc2)[C@@H](O)[C@H]1O
InChI Key: InChIKey=GTWDNIHZCBBNKH-DDHJBXDOSA-N
Data: 1 KI  1 IC50
Activity Spreadsheet -- Enzyme Inhibition Constant Data from BindingDB
Found 2 hits for monomerid = 50168999
Trg + Lig
Ki
nM
ΔG°
kcal/mole
IC50
nM
Kd
nM
EC50/IC50
nM
koff
s-1
kon
M-1s-1
pHTemp
°C
Alpha-mannosidase
(Glycine max)
BDBM50168999
((2R,3R,4R,5R)-5-(Benzylamino-methyl)-pyrrolidine-2...)
Show SMILES O[C@H]1N[C@H](CNCc2ccccc2)[C@@H](O)[C@H]1O
Show InChI InChI=1S/C12H18N2O3/c15-10-9(14-12(17)11(10)16)7-13-6-8-4-2-1-3-5-8/h1-5,9-17H,6-7H2/t9-,10-,11-,12-/m1/s1
1.20E+3n/an/an/an/an/an/an/an/a
Institute of Chemical Sciences and Engineering
Curated by ChEMBL
Assay Description
Binding affinity towards alpha-Mannosidase isolated from Jack bean
J Med Chem 48: 4237-46 (2005)
Article DOI: 10.1021/jm0409019
BindingDB Entry DOI: 10.7270/Q24J0DNV
Alpha-mannosidase
(Glycine max)
BDBM50168999
((2R,3R,4R,5R)-5-(Benzylamino-methyl)-pyrrolidine-2...)
Show SMILES O[C@H]1N[C@H](CNCc2ccccc2)[C@@H](O)[C@H]1O
Show InChI InChI=1S/C12H18N2O3/c15-10-9(14-12(17)11(10)16)7-13-6-8-4-2-1-3-5-8/h1-5,9-17H,6-7H2/t9-,10-,11-,12-/m1/s1
n/an/a 6.20E+3n/an/an/an/an/an/a
Institute of Chemical Sciences and Engineering
Curated by ChEMBL
Assay Description
Concentration of compound inhibiting alpha-Mannosidase isolated from Jack bean
J Med Chem 48: 4237-46 (2005)
Article DOI: 10.1021/jm0409019
BindingDB Entry DOI: 10.7270/Q24J0DNV