BDBM50169056 CHEMBL3806163
SMILES: COc1ccc(cc1)C(=O)C1CCN(CC1)C(=O)CCCc1cn2cc(F)cc2c(=O)[nH]1
InChI Key: InChIKey=GMBPALAESNNJFY-UHFFFAOYSA-N
Data: 2 IC50  1 EC50
Activity Spreadsheet -- Enzyme Inhibition Constant Data from BindingDB
Found 3 hits for monomerid = 50169056
Trg + Lig
Ki
nM
ΔG°
kcal/mole
IC50
nM
Kd
nM
EC50/IC50
nM
koff
s-1
kon
M-1s-1
pHTemp
°C
Tankyrase 1/2
(Homo sapiens (Human))
BDBM50169056
(CHEMBL3806163)
Show SMILES COc1ccc(cc1)C(=O)C1CCN(CC1)C(=O)CCCc1cn2cc(F)cc2c(=O)[nH]1
Show InChI InChI=1S/C24H26FN3O4/c1-32-20-7-5-16(6-8-20)23(30)17-9-11-27(12-10-17)22(29)4-2-3-19-15-28-14-18(25)13-21(28)24(31)26-19/h5-8,13-15,17H,2-4,9-12H2,1H3,(H,26,31)
n/an/an/an/a 2.20n/an/an/an/a
Therachem Research Medilab (India) Pvt. Ltd.
Curated by ChEMBL
Assay Description
Inhibition of tankyrase in human DLD1 cells assessed as increase in axin2 level after 24 hrs by fluorescence analysis
ACS Med Chem Lett 7: 209-10 (2016)
BindingDB Entry DOI: 10.7270/Q2F76FFJ
Poly [ADP-ribose] polymerase tankyrase-1
(Homo sapiens (Human))
BDBM50169056
(CHEMBL3806163)
Show SMILES COc1ccc(cc1)C(=O)C1CCN(CC1)C(=O)CCCc1cn2cc(F)cc2c(=O)[nH]1
Show InChI InChI=1S/C24H26FN3O4/c1-32-20-7-5-16(6-8-20)23(30)17-9-11-27(12-10-17)22(29)4-2-3-19-15-28-14-18(25)13-21(28)24(31)26-19/h5-8,13-15,17H,2-4,9-12H2,1H3,(H,26,31)
n/an/a 2n/an/an/an/an/an/a
Therachem Research Medilab (India) Pvt. Ltd.
Curated by ChEMBL
Assay Description
Inhibition of GST-tagged TNKS1 (1023 to 1327 residues) (unknown origin) autoparsylation using biotinylated NAD incubated for 1 hr by ELISA
ACS Med Chem Lett 7: 209-10 (2016)
BindingDB Entry DOI: 10.7270/Q2F76FFJ
Poly [ADP-ribose] polymerase tankyrase-2
(Homo sapiens (Human))
BDBM50169056
(CHEMBL3806163)
Show SMILES COc1ccc(cc1)C(=O)C1CCN(CC1)C(=O)CCCc1cn2cc(F)cc2c(=O)[nH]1
Show InChI InChI=1S/C24H26FN3O4/c1-32-20-7-5-16(6-8-20)23(30)17-9-11-27(12-10-17)22(29)4-2-3-19-15-28-14-18(25)13-21(28)24(31)26-19/h5-8,13-15,17H,2-4,9-12H2,1H3,(H,26,31)
n/an/a 1.70n/an/an/an/an/an/a
Therachem Research Medilab (India) Pvt. Ltd.
Curated by ChEMBL
Assay Description
Inhibition of GST-tagged TNKS2 (873 to 1166 residues) (unknown origin) autoparsylation using biotinylated NAD incubated for 1 hr by ELISA
ACS Med Chem Lett 7: 209-10 (2016)
BindingDB Entry DOI: 10.7270/Q2F76FFJ