BDBM50169080 CHEMBL3806173
SMILES: CC(=O)Nc1ccc(Oc2cncc3sc(cc23)-c2nnn[nH]2)cc1
InChI Key: InChIKey=BACOSPUGMHOGST-UHFFFAOYSA-N
Data: 1 IC50
Activity Spreadsheet -- Enzyme Inhibition Constant Data from BindingDB
Found 1 hit for monomerid = 50169080
Trg + Lig
Ki
nM
ΔG°
kcal/mole
IC50
nM
Kd
nM
EC50/IC50
nM
koff
s-1
kon
M-1s-1
pHTemp
°C
Cyclin-C
(Homo sapiens (Human))
BDBM50169080
(CHEMBL3806173)
Show SMILES CC(=O)Nc1ccc(Oc2cncc3sc(cc23)-c2nnn[nH]2)cc1
Show InChI InChI=1S/C16H12N6O2S/c1-9(23)18-10-2-4-11(5-3-10)24-13-7-17-8-15-12(13)6-14(25-15)16-19-21-22-20-16/h2-8H,1H3,(H,18,23)(H,19,20,21,22)
n/an/a 2n/an/an/an/an/an/a
Genentech, Inc
Curated by ChEMBL
Assay Description
Inhibition of full length human recombinant His-tagged CDK8/Cyclin C expressed in baculovirus expression system by fluorescence polarization assay
ACS Med Chem Lett 7: 223-8 (2016)
BindingDB Entry DOI: 10.7270/Q29G5PPC