BDBM50169392 1-[4-(3'-Chloro-biphenyl-4-yl)-1-methyl-piperidin-4-ylmethyl]-3-(3,5-dichloro-phenyl)-urea::CHEMBL367215
SMILES: CN1CCC(CNC(=O)Nc2cc(Cl)cc(Cl)c2)(CC1)c1ccc(cc1)-c1cccc(Cl)c1
InChI Key: InChIKey=GUMUOONUTXLUDP-UHFFFAOYSA-N
Data: 1 KI
Activity Spreadsheet -- Enzyme Inhibition Constant Data from BindingDB
Found 1 hit for monomerid = 50169392
Trg + Lig
Ki
nM
ΔG°
kcal/mole
IC50
nM
Kd
nM
EC50/IC50
nM
koff
s-1
kon
M-1s-1
pHTemp
°C
Melanin-concentrating hormone receptor 1
(Homo sapiens (Human))
BDBM50169392
(1-[4-(3'-Chloro-biphenyl-4-yl)-1-methyl-piperidin-...)
Show SMILES CN1CCC(CNC(=O)Nc2cc(Cl)cc(Cl)c2)(CC1)c1ccc(cc1)-c1cccc(Cl)c1
Show InChI InChI=1S/C26H26Cl3N3O/c1-32-11-9-26(10-12-32,17-30-25(33)31-24-15-22(28)14-23(29)16-24)20-7-5-18(6-8-20)19-3-2-4-21(27)13-19/h2-8,13-16H,9-12,17H2,1H3,(H2,30,31,33)
Reactome pathway
2.60n/an/an/an/an/an/an/an/a
Pharmacopeia Drug Discovery, Inc.
Curated by ChEMBL
Assay Description
Ability to displace [125-I]-MCH()0.5 nM from human MCH1R(2.5 uM) expressed in CHO cells
Bioorg Med Chem Lett 15: 3696-700 (2005)
Article DOI: 10.1016/j.bmcl.2005.05.085
BindingDB Entry DOI: 10.7270/Q2ZS2W16