null
SMILES: O=C(Nc1nccs1)c1ncsc1CCc1ccccc1
InChI Key: InChIKey=ORVKVXDJIHVRSH-UHFFFAOYSA-N
Activity Spreadsheet -- Enzyme Inhibition Constant Data from BindingDB
Found 2 hits for monomerid = 50169670
Trg + Lig
Ki
nM
ΔG°
kcal/mole
IC50
nM
Kd
nM
EC50/IC50
nM
koff
s-1
kon
M-1s-1
pHTemp
°C
Methionine aminopeptidase 1
(Saccharomyces cerevisiae)
BDBM50169670
(5-Phenethyl-thiazole-4-carboxylic acid thiazol-2-y...)
Show SMILES O=C(Nc1nccs1)c1ncsc1CCc1ccccc1
Show InChI InChI=1S/C15H13N3OS2/c19-14(18-15-16-8-9-20-15)13-12(21-10-17-13)7-6-11-4-2-1-3-5-11/h1-5,8-10H,6-7H2,(H,16,18,19)
Reactome pathway
n/an/a 660n/an/an/an/an/an/a
Graduate School of the Chinese Academy of Sciences
Curated by ChEMBL
Assay Description
Inhibitory concentration required against Saccharomyces cerevisiae MetAP1 (330 nM)
Bioorg Med Chem Lett 15: 3732-6 (2005)
Article DOI: 10.1016/j.bmcl.2005.05.055
BindingDB Entry DOI: 10.7270/Q2T1534B
Methionine aminopeptidase
(Escherichia coli (strain K12))
BDBM50169670
(5-Phenethyl-thiazole-4-carboxylic acid thiazol-2-y...)
Show SMILES O=C(Nc1nccs1)c1ncsc1CCc1ccccc1
Show InChI InChI=1S/C15H13N3OS2/c19-14(18-15-16-8-9-20-15)13-12(21-10-17-13)7-6-11-4-2-1-3-5-11/h1-5,8-10H,6-7H2,(H,16,18,19)
n/an/a 65n/an/an/an/an/an/a
Graduate School of the Chinese Academy of Sciences
Curated by ChEMBL
Assay Description
Inhibitory concentration required against Escherichia coli MetAP1 (150 nM)
Bioorg Med Chem Lett 15: 3732-6 (2005)
Article DOI: 10.1016/j.bmcl.2005.05.055
BindingDB Entry DOI: 10.7270/Q2T1534B