BDBM50169903 2-(4-Chloro-phenyl)-3-cyclohexyl-1-[(isopropyl-methyl-carbamoyl)-methyl]-1H-indole-6-carboxylic acid::CHEMBL190945
SMILES: CC(C)N(C)C(=O)Cn1c(c(C2CCCCC2)c2ccc(cc12)C(O)=O)-c1ccc(Cl)cc1
InChI Key: InChIKey=SXRHCXFOKLFMGE-UHFFFAOYSA-N
Data: 1 IC50
Activity Spreadsheet -- Enzyme Inhibition Constant Data from BindingDB
Found 1 hit for monomerid = 50169903
Trg + Lig
Ki
nM
ΔG°
kcal/mole
IC50
nM
Kd
nM
EC50/IC50
nM
koff
s-1
kon
M-1s-1
pHTemp
°C
Hepatitis C virus NS5B RNA-dependent RNA polymerase
(Hepatitis C virus)
BDBM50169903
(2-(4-Chloro-phenyl)-3-cyclohexyl-1-[(isopropyl-met...)
Show SMILES CC(C)N(C)C(=O)Cn1c(c(C2CCCCC2)c2ccc(cc12)C(O)=O)-c1ccc(Cl)cc1
Show InChI InChI=1S/C27H31ClN2O3/c1-17(2)29(3)24(31)16-30-23-15-20(27(32)33)11-14-22(23)25(18-7-5-4-6-8-18)26(30)19-9-12-21(28)13-10-19/h9-15,17-18H,4-8,16H2,1-3H3,(H,32,33)
n/an/a 11n/an/an/an/an/an/a
IRBM (Merck Research Laboratories
Curated by ChEMBL
Assay Description
Inhibitory activity against by hepatitis C virus NS5B polymerase
J Med Chem 48: 4547-57 (2005)
Article DOI: 10.1021/jm050056+
BindingDB Entry DOI: 10.7270/Q24B30VN