BDBM50169907 3-Cyclohexyl-1-[2-(1,1-dioxo-1lambda*6*-thiomorpholin-4-yl)-2-oxo-ethyl]-2-phenyl-1H-indole-6-carboxylic acid::CHEMBL372235
SMILES: OC(=O)c1ccc2c(C3CCCCC3)c(-c3ccccc3)n(CC(=O)N3CCS(=O)(=O)CC3)c2c1
InChI Key: InChIKey=OQGKJZJBMWKVHH-UHFFFAOYSA-N
Data: 1 IC50
Activity Spreadsheet -- Enzyme Inhibition Constant Data from BindingDB
Found 1 hit for monomerid = 50169907
Trg + Lig
Ki
nM
ΔG°
kcal/mole
IC50
nM
Kd
nM
EC50/IC50
nM
koff
s-1
kon
M-1s-1
pHTemp
°C
Hepatitis C virus NS5B RNA-dependent RNA polymerase
(Hepatitis C virus)
BDBM50169907
(3-Cyclohexyl-1-[2-(1,1-dioxo-1lambda*6*-thiomorpho...)
Show SMILES OC(=O)c1ccc2c(C3CCCCC3)c(-c3ccccc3)n(CC(=O)N3CCS(=O)(=O)CC3)c2c1
Show InChI InChI=1S/C27H30N2O5S/c30-24(28-13-15-35(33,34)16-14-28)18-29-23-17-21(27(31)32)11-12-22(23)25(19-7-3-1-4-8-19)26(29)20-9-5-2-6-10-20/h2,5-6,9-12,17,19H,1,3-4,7-8,13-16,18H2,(H,31,32)
n/an/a 43n/an/an/an/an/an/a
IRBM (Merck Research Laboratories
Curated by ChEMBL
Assay Description
Inhibitory activity against by hepatitis C virus NS5B polymerase
J Med Chem 48: 4547-57 (2005)
Article DOI: 10.1021/jm050056+
BindingDB Entry DOI: 10.7270/Q24B30VN