BDBM50169965 CHEMBL363253::[3H-Benzothiazol-(2Z)-ylidene]-{2-[2-(2-fluoro-phenyl)-ethylamino]-pyrimidin-4-yl}-acetonitrile
SMILES: Fc1ccccc1CCNc1nccc(n1)C(C#N)c1nc2ccccc2s1
InChI Key: InChIKey=BIZJCJPDVVRBDV-UHFFFAOYSA-N
Data: 1 IC50
Activity Spreadsheet -- Enzyme Inhibition Constant Data from BindingDB
Found 1 hit for monomerid = 50169965
Trg + Lig
Ki
nM
ΔG°
kcal/mole
IC50
nM
Kd
nM
EC50/IC50
nM
koff
s-1
kon
M-1s-1
pHTemp
°C
c-Jun N-terminal kinase 3
(Rattus norvegicus)
BDBM50169965
(CHEMBL363253 | [3H-Benzothiazol-(2Z)-ylidene]-{2-[...)
Show SMILES Fc1ccccc1CCNc1nccc(n1)C(C#N)c1nc2ccccc2s1
Show InChI InChI=1S/C21H16FN5S/c22-16-6-2-1-5-14(16)9-11-24-21-25-12-10-17(27-21)15(13-23)20-26-18-7-3-4-8-19(18)28-20/h1-8,10,12,15H,9,11H2,(H,24,25,27)
n/an/a 273n/an/an/an/an/an/a
Serono Pharmaceutical Research Institute
Curated by ChEMBL
Assay Description
Inhibition of rat c-Jun N-terminal kinase 3
J Med Chem 48: 4596-607 (2005)
Article DOI: 10.1021/jm0310986
BindingDB Entry DOI: 10.7270/Q2K9389G