BDBM50169975 CHEMBL188499::[3H-Benzothiazol-(2Z)-ylidene]-(2-morpholin-4-yl-pyrimidin-4-yl)-acetonitrile
SMILES: N#CC(c1nc2ccccc2s1)c1ccnc(n1)N1CCOCC1
InChI Key: InChIKey=VWEYROREJIBQGN-UHFFFAOYSA-N
Data: 1 IC50
Activity Spreadsheet -- Enzyme Inhibition Constant Data from BindingDB
Found 1 hit for monomerid = 50169975
Trg + Lig
Ki
nM
ΔG°
kcal/mole
IC50
nM
Kd
nM
EC50/IC50
nM
koff
s-1
kon
M-1s-1
pHTemp
°C
c-Jun N-terminal kinase 3
(Rattus norvegicus)
BDBM50169975
(CHEMBL188499 | [3H-Benzothiazol-(2Z)-ylidene]-(2-m...)
Show SMILES N#CC(c1nc2ccccc2s1)c1ccnc(n1)N1CCOCC1
Show InChI InChI=1S/C17H15N5OS/c18-11-12(16-20-14-3-1-2-4-15(14)24-16)13-5-6-19-17(21-13)22-7-9-23-10-8-22/h1-6,12H,7-10H2
n/an/a 2.90E+3n/an/an/an/an/an/a
Serono Pharmaceutical Research Institute
Curated by ChEMBL
Assay Description
Inhibition of rat c-Jun N-terminal kinase 3
J Med Chem 48: 4596-607 (2005)
Article DOI: 10.1021/jm0310986
BindingDB Entry DOI: 10.7270/Q2K9389G