BDBM50169979 CHEMBL191021::[2-(3-Amino-propylamino)-pyrimidin-4-yl]-[3H-benzothiazol-(2Z)-ylidene]-acetonitrile
SMILES: NCCCNc1nccc(n1)C(C#N)c1nc2ccccc2s1
InChI Key: InChIKey=WJCHYBADWFGZDG-UHFFFAOYSA-N
Data: 1 IC50
Activity Spreadsheet -- Enzyme Inhibition Constant Data from BindingDB
Found 1 hit for monomerid = 50169979
Trg + Lig
Ki
nM
ΔG°
kcal/mole
IC50
nM
Kd
nM
EC50/IC50
nM
koff
s-1
kon
M-1s-1
pHTemp
°C
c-Jun N-terminal kinase 3
(Rattus norvegicus)
BDBM50169979
(CHEMBL191021 | [2-(3-Amino-propylamino)-pyrimidin-...)
Show SMILES NCCCNc1nccc(n1)C(C#N)c1nc2ccccc2s1
Show InChI InChI=1S/C16H16N6S/c17-7-3-8-19-16-20-9-6-12(22-16)11(10-18)15-21-13-4-1-2-5-14(13)23-15/h1-2,4-6,9,11H,3,7-8,17H2,(H,19,20,22)
n/an/a 707n/an/an/an/an/an/a
Serono Pharmaceutical Research Institute
Curated by ChEMBL
Assay Description
Inhibition of rat c-Jun N-terminal kinase 3
J Med Chem 48: 4596-607 (2005)
Article DOI: 10.1021/jm0310986
BindingDB Entry DOI: 10.7270/Q2K9389G