BDBM50169993 CHEMBL425553::[3H-Benzothiazol-(2Z)-ylidene]-[2-(2-dimethylamino-ethylamino)-pyrimidin-4-yl]-acetonitrile
SMILES: CN(C)CCNc1nccc(n1)C(C#N)c1nc2ccccc2s1
InChI Key: InChIKey=VGPCRDIHTWRADA-UHFFFAOYSA-N
Data: 1 IC50
Activity Spreadsheet -- Enzyme Inhibition Constant Data from BindingDB
Found 1 hit for monomerid = 50169993
Trg + Lig
Ki
nM
ΔG°
kcal/mole
IC50
nM
Kd
nM
EC50/IC50
nM
koff
s-1
kon
M-1s-1
pHTemp
°C
c-Jun N-terminal kinase 3
(Rattus norvegicus)
BDBM50169993
(CHEMBL425553 | [3H-Benzothiazol-(2Z)-ylidene]-[2-(...)
Show SMILES CN(C)CCNc1nccc(n1)C(C#N)c1nc2ccccc2s1
Show InChI InChI=1S/C17H18N6S/c1-23(2)10-9-20-17-19-8-7-13(22-17)12(11-18)16-21-14-5-3-4-6-15(14)24-16/h3-8,12H,9-10H2,1-2H3,(H,19,20,22)
n/an/a 1.30E+3n/an/an/an/an/an/a
Serono Pharmaceutical Research Institute
Curated by ChEMBL
Assay Description
Inhibition of rat c-Jun N-terminal kinase 3
J Med Chem 48: 4596-607 (2005)
Article DOI: 10.1021/jm0310986
BindingDB Entry DOI: 10.7270/Q2K9389G