BDBM50170002 CHEMBL365146::[3H-Benzothiazol-(2Z)-ylidene]-[2-(4-methyl-piperazin-1-yl)-pyrimidin-4-yl]-acetonitrile
SMILES: CN1CCN(CC1)c1nccc(n1)C(C#N)c1nc2ccccc2s1
InChI Key: InChIKey=DBOLZWKIJLJXJS-UHFFFAOYSA-N
Data: 1 IC50
Activity Spreadsheet -- Enzyme Inhibition Constant Data from BindingDB
Found 1 hit for monomerid = 50170002
Trg + Lig
Ki
nM
ΔG°
kcal/mole
IC50
nM
Kd
nM
EC50/IC50
nM
koff
s-1
kon
M-1s-1
pHTemp
°C
c-Jun N-terminal kinase 3
(Rattus norvegicus)
BDBM50170002
(CHEMBL365146 | [3H-Benzothiazol-(2Z)-ylidene]-[2-(...)
Show SMILES CN1CCN(CC1)c1nccc(n1)C(C#N)c1nc2ccccc2s1
Show InChI InChI=1S/C18H18N6S/c1-23-8-10-24(11-9-23)18-20-7-6-14(22-18)13(12-19)17-21-15-4-2-3-5-16(15)25-17/h2-7,13H,8-11H2,1H3
n/an/a 6.80E+3n/an/an/an/an/an/a
Serono Pharmaceutical Research Institute
Curated by ChEMBL
Assay Description
Inhibition of rat c-Jun N-terminal kinase 3
J Med Chem 48: 4596-607 (2005)
Article DOI: 10.1021/jm0310986
BindingDB Entry DOI: 10.7270/Q2K9389G