null
SMILES: FC(F)(F)c1cc(NC(=O)COc2ccc(cc2)-c2cccnc2)ccc1CN1CCNCC1
InChI Key: InChIKey=ANUKWIYBPKFKPT-UHFFFAOYSA-N
Activity Spreadsheet -- Enzyme Inhibition Constant Data from BindingDB
Found 3 hits for monomerid = 50170171
Trg + Lig
Ki
nM
ΔG°
kcal/mole
IC50
nM
Kd
nM
EC50/IC50
nM
koff
s-1
kon
M-1s-1
pHTemp
°C
MAP kinase-interacting serine/threonine-protein kinase 1
(Homo sapiens (Human))
BDBM50170171
(CHEMBL3805029)
Show SMILES FC(F)(F)c1cc(NC(=O)COc2ccc(cc2)-c2cccnc2)ccc1CN1CCNCC1
Show InChI InChI=1S/C25H25F3N4O2/c26-25(27,28)23-14-21(6-3-20(23)16-32-12-10-29-11-13-32)31-24(33)17-34-22-7-4-18(5-8-22)19-2-1-9-30-15-19/h1-9,14-15,29H,10-13,16-17H2,(H,31,33)
NCI pathway
Reactome pathway
n/an/a 350n/an/an/an/an/an/a
Experimental Therapeutics Centre
Curated by ChEMBL
Assay Description
Inhibition of N-terminal GST-tagged MNK1 kinase domain (37 to 341 residues) (unknown origin) expressed in Escherichia coli BL21(DE3) cells using JH3 ...
J Med Chem 59: 3063-78 (2016)
BindingDB Entry DOI: 10.7270/Q2028TF3
MAP kinase-interacting serine/threonine-protein kinase 2
(Homo sapiens (Human))
BDBM50170171
(CHEMBL3805029)
Show SMILES FC(F)(F)c1cc(NC(=O)COc2ccc(cc2)-c2cccnc2)ccc1CN1CCNCC1
Show InChI InChI=1S/C25H25F3N4O2/c26-25(27,28)23-14-21(6-3-20(23)16-32-12-10-29-11-13-32)31-24(33)17-34-22-7-4-18(5-8-22)19-2-1-9-30-15-19/h1-9,14-15,29H,10-13,16-17H2,(H,31,33)
n/an/a 12n/an/an/an/an/an/a
Experimental Therapeutics Centre
Curated by ChEMBL
Assay Description
Inhibition of N-terminal GST-tagged MNK2 kinase domain (72 to 385 residues) (unknown origin) expressed in Escherichia coli BL21(DE3) cells using JH3 ...
J Med Chem 59: 3063-78 (2016)
BindingDB Entry DOI: 10.7270/Q2028TF3
Breakpoint cluster region protein/Tyrosine-protein kinase ABL1
(Homo sapiens (Human))
BDBM50170171
(CHEMBL3805029)
Show SMILES FC(F)(F)c1cc(NC(=O)COc2ccc(cc2)-c2cccnc2)ccc1CN1CCNCC1
Show InChI InChI=1S/C25H25F3N4O2/c26-25(27,28)23-14-21(6-3-20(23)16-32-12-10-29-11-13-32)31-24(33)17-34-22-7-4-18(5-8-22)19-2-1-9-30-15-19/h1-9,14-15,29H,10-13,16-17H2,(H,31,33)
NCI pathway
Reactome pathway
n/an/a>1.00E+4n/an/an/an/an/an/a
Experimental Therapeutics Centre
Curated by ChEMBL
Assay Description
Inhibition of BCR fused full length human recombinant N-terminal His-tagged ABL (2 to 1130 residues) expressed in baculovirus expression system using...
J Med Chem 59: 3063-78 (2016)
BindingDB Entry DOI: 10.7270/Q2028TF3