BDBM50170233 CHEMBL3805789
SMILES: Clc1cnc2[nH]c(=O)c(=O)[nH]c2c1Cl
InChI Key: InChIKey=UOUKUQNWCKDDJN-UHFFFAOYSA-N
Data: 1 IC50
Activity Spreadsheet -- Enzyme Inhibition Constant Data from BindingDB
Found 1 hit for monomerid = 50170233
Trg + Lig
Ki
nM
ΔG°
kcal/mole
IC50
nM
Kd
nM
EC50/IC50
nM
koff
s-1
kon
M-1s-1
pHTemp
°C
D-Amino Acid Oxidase (DAAO)
(Sus scrofa (pig))
BDBM50170233
(CHEMBL3805789)
Show SMILES Clc1cnc2[nH]c(=O)c(=O)[nH]c2c1Cl
Show InChI InChI=1S/C7H3Cl2N3O2/c8-2-1-10-5-4(3(2)9)11-6(13)7(14)12-5/h1H,(H,11,13)(H,10,12,14)
Reactome pathway
n/an/a 650n/an/an/an/an/an/a
Shanghai Jiao Tong University
Curated by ChEMBL
Assay Description
Inhibition of DAAO in porcine kidney homogenate using D-alanine as substrate assessed as pyruvate production incubated for 5 mins by microplate reade...
Eur J Med Chem 117: 19-32 (2016)
BindingDB Entry DOI: 10.7270/Q2V989ZS