BDBM50170296 (S)-2-{4'-[(4-Benzyloxy-benzofuran-2-carbonyl)-amino]-biphenyl-4-sulfonylamino}-3-methyl-butyric acid::CHEMBL359770
SMILES: CC(C)[C@H](NS(=O)(=O)c1ccc(cc1)-c1ccc(NC(=O)c2cc3c(OCc4ccccc4)cccc3o2)cc1)C(O)=O
InChI Key: InChIKey=NVNDKOXSOGFACQ-HKBQPEDESA-N
Data: 2 IC50
Activity Spreadsheet -- Enzyme Inhibition Constant Data from BindingDB
Found 2 hits for monomerid = 50170296
Trg + Lig
Ki
nM
ΔG°
kcal/mole
IC50
nM
Kd
nM
EC50/IC50
nM
koff
s-1
kon
M-1s-1
pHTemp
°C
72 kDa type IV collagenase
(Homo sapiens (Human))
BDBM50170296
((S)-2-{4'-[(4-Benzyloxy-benzofuran-2-carbonyl)-ami...)
Show SMILES CC(C)[C@H](NS(=O)(=O)c1ccc(cc1)-c1ccc(NC(=O)c2cc3c(OCc4ccccc4)cccc3o2)cc1)C(O)=O
Show InChI InChI=1S/C33H30N2O7S/c1-21(2)31(33(37)38)35-43(39,40)26-17-13-24(14-18-26)23-11-15-25(16-12-23)34-32(36)30-19-27-28(9-6-10-29(27)42-30)41-20-22-7-4-3-5-8-22/h3-19,21,31,35H,20H2,1-2H3,(H,34,36)(H,37,38)/t31-/m0/s1
Reactome pathway
n/an/a 62n/an/an/an/an/an/a
Wyeth Research
Curated by ChEMBL
Assay Description
Inhibitory concentration against MMP-2
Bioorg Med Chem Lett 15: 4105-9 (2005)
Article DOI: 10.1016/j.bmcl.2005.06.019
BindingDB Entry DOI: 10.7270/Q2TX3DXK
Matrix metalloproteinase 13
(Bos taurus)
BDBM50170296
((S)-2-{4'-[(4-Benzyloxy-benzofuran-2-carbonyl)-ami...)
Show SMILES CC(C)[C@H](NS(=O)(=O)c1ccc(cc1)-c1ccc(NC(=O)c2cc3c(OCc4ccccc4)cccc3o2)cc1)C(O)=O
Show InChI InChI=1S/C33H30N2O7S/c1-21(2)31(33(37)38)35-43(39,40)26-17-13-24(14-18-26)23-11-15-25(16-12-23)34-32(36)30-19-27-28(9-6-10-29(27)42-30)41-20-22-7-4-3-5-8-22/h3-19,21,31,35H,20H2,1-2H3,(H,34,36)(H,37,38)/t31-/m0/s1
n/an/a 3.5n/an/an/an/an/an/a
Wyeth Research
Curated by ChEMBL
Assay Description
Inhibitory concentration against MMP-13 of bovine articular cartilage explants
Bioorg Med Chem Lett 15: 4105-9 (2005)
Article DOI: 10.1016/j.bmcl.2005.06.019
BindingDB Entry DOI: 10.7270/Q2TX3DXK