null
SMILES: COC(CC(C)C)Cc1scnc1C(=O)Nc1nccs1
InChI Key: InChIKey=DEQHFJLJDUFUES-UHFFFAOYSA-N
Activity Spreadsheet -- Enzyme Inhibition Constant Data from BindingDB
Found 2 hits for monomerid = 50170360
Trg + Lig
Ki
nM
ΔG°
kcal/mole
IC50
nM
Kd
nM
EC50/IC50
nM
koff
s-1
kon
M-1s-1
pHTemp
°C
Methionine aminopeptidase 1
(Saccharomyces cerevisiae)
BDBM50170360
(5-(2-Methoxy-4-methyl-pentyl)-thiazole-4-carboxyli...)
Show SMILES COC(CC(C)C)Cc1scnc1C(=O)Nc1nccs1
Show InChI InChI=1S/C14H19N3O2S2/c1-9(2)6-10(19-3)7-11-12(16-8-21-11)13(18)17-14-15-4-5-20-14/h4-5,8-10H,6-7H2,1-3H3,(H,15,17,18)
Reactome pathway
n/an/a 500n/an/an/an/an/an/a
Shanghai Graduate School of the Chinese Academy of Sciences
Curated by ChEMBL
Assay Description
Inhibitory concentration against ScMetAP1 enzyme activity
Bioorg Med Chem Lett 15: 4130-5 (2005)
Article DOI: 10.1016/j.bmcl.2005.06.005
BindingDB Entry DOI: 10.7270/Q2FN15RH
Methionine aminopeptidase
(Escherichia coli (strain K12))
BDBM50170360
(5-(2-Methoxy-4-methyl-pentyl)-thiazole-4-carboxyli...)
Show SMILES COC(CC(C)C)Cc1scnc1C(=O)Nc1nccs1
Show InChI InChI=1S/C14H19N3O2S2/c1-9(2)6-10(19-3)7-11-12(16-8-21-11)13(18)17-14-15-4-5-20-14/h4-5,8-10H,6-7H2,1-3H3,(H,15,17,18)
n/an/a 90n/an/an/an/an/an/a
Shanghai Graduate School of the Chinese Academy of Sciences
Curated by ChEMBL
Assay Description
Inhibitory concentration against EcMetAP1 enzyme activity
Bioorg Med Chem Lett 15: 4130-5 (2005)
Article DOI: 10.1016/j.bmcl.2005.06.005
BindingDB Entry DOI: 10.7270/Q2FN15RH