BDBM50170370 5-[2-Methoxy-2-(4-methoxy-phenyl)-ethyl]-thiazole-4-carboxylic acid thiazol-2-ylamide::CHEMBL188976
SMILES: COC(Cc1scnc1C(=O)Nc1nccs1)c1ccc(OC)cc1
InChI Key: InChIKey=GJLAORCBTDMCLD-UHFFFAOYSA-N
Data: 2 IC50
Activity Spreadsheet -- Enzyme Inhibition Constant Data from BindingDB
Found 2 hits for monomerid = 50170370
Trg + Lig
Ki
nM
ΔG°
kcal/mole
IC50
nM
Kd
nM
EC50/IC50
nM
koff
s-1
kon
M-1s-1
pHTemp
°C
Methionine aminopeptidase 1
(Saccharomyces cerevisiae)
BDBM50170370
(5-[2-Methoxy-2-(4-methoxy-phenyl)-ethyl]-thiazole-...)
Show SMILES COC(Cc1scnc1C(=O)Nc1nccs1)c1ccc(OC)cc1
Show InChI InChI=1S/C17H17N3O3S2/c1-22-12-5-3-11(4-6-12)13(23-2)9-14-15(19-10-25-14)16(21)20-17-18-7-8-24-17/h3-8,10,13H,9H2,1-2H3,(H,18,20,21)
Reactome pathway
n/an/a 310n/an/an/an/an/an/a
Shanghai Graduate School of the Chinese Academy of Sciences
Curated by ChEMBL
Assay Description
Inhibitory concentration against ScMetAP1 enzyme activity
Bioorg Med Chem Lett 15: 4130-5 (2005)
Article DOI: 10.1016/j.bmcl.2005.06.005
BindingDB Entry DOI: 10.7270/Q2FN15RH
Methionine Aminopeptidase (MAP)
(Escherichia coli (strain K12))
BDBM50170370
(5-[2-Methoxy-2-(4-methoxy-phenyl)-ethyl]-thiazole-...)
Show SMILES COC(Cc1scnc1C(=O)Nc1nccs1)c1ccc(OC)cc1
Show InChI InChI=1S/C17H17N3O3S2/c1-22-12-5-3-11(4-6-12)13(23-2)9-14-15(19-10-25-14)16(21)20-17-18-7-8-24-17/h3-8,10,13H,9H2,1-2H3,(H,18,20,21)
n/an/a 23n/an/an/an/an/an/a
Shanghai Graduate School of the Chinese Academy of Sciences
Curated by ChEMBL
Assay Description
Inhibitory concentration against EcMetAP1 enzyme activity
Bioorg Med Chem Lett 15: 4130-5 (2005)
Article DOI: 10.1016/j.bmcl.2005.06.005
BindingDB Entry DOI: 10.7270/Q2FN15RH