BDBM50170604 CHEMBL3805585
SMILES: Oc1c2C(=O)N3CCCN3Cc2c(C#N)c2cc(Cc3cccc(Cl)c3F)cnc12
InChI Key: InChIKey=CYJVKJHOTQQQQB-UHFFFAOYSA-N
Data: 2 IC50
Activity Spreadsheet -- Enzyme Inhibition Constant Data from BindingDB
Found 2 hits for monomerid = 50170604
Trg + Lig
Ki
nM
ΔG°
kcal/mole
IC50
nM
Kd
nM
EC50/IC50
nM
koff
s-1
kon
M-1s-1
pHTemp
°C
Integrase
(Human immunodeficiency virus 1)
BDBM50170604
(CHEMBL3805585)
Show SMILES Oc1c2C(=O)N3CCCN3Cc2c(C#N)c2cc(Cc3cccc(Cl)c3F)cnc12
Show InChI InChI=1S/C22H16ClFN4O2/c23-17-4-1-3-13(19(17)24)7-12-8-14-15(9-25)16-11-27-5-2-6-28(27)22(30)18(16)21(29)20(14)26-10-12/h1,3-4,8,10,29H,2,5-7,11H2
n/an/a 415n/an/an/an/an/an/a
GlaxoSmithKline Research& Development
Curated by ChEMBL
Assay Description
Inhibition of pseudotype HIV1 integrase strand transfer activity assessed as reduction in viral replication in in HIV1 infected human CIP4 cells afte...
Eur J Med Chem 117: 99-112 (2016)
BindingDB Entry DOI: 10.7270/Q2G162R8
Integrase
(Human immunodeficiency virus 1)
BDBM50170604
(CHEMBL3805585)
Show SMILES Oc1c2C(=O)N3CCCN3Cc2c(C#N)c2cc(Cc3cccc(Cl)c3F)cnc12
Show InChI InChI=1S/C22H16ClFN4O2/c23-17-4-1-3-13(19(17)24)7-12-8-14-15(9-25)16-11-27-5-2-6-28(27)22(30)18(16)21(29)20(14)26-10-12/h1,3-4,8,10,29H,2,5-7,11H2
n/an/a 2.20n/an/an/an/an/an/a
GlaxoSmithKline Research& Development
Curated by ChEMBL
Assay Description
Inhibition of pseudotype HIV1 integrase strand transfer activity assessed as reduction in viral replication in HIV1 infected human CIP4 cells after 2...
Eur J Med Chem 117: 99-112 (2016)
BindingDB Entry DOI: 10.7270/Q2G162R8