BDBM50170613 1-(3'-Cyano-biphenyl-4-yl)-3-(3-fluoro-4-trifluoromethyl-phenyl)-1-(2-pyrrolidin-1-yl-ethyl)-urea::CHEMBL190780
SMILES: Fc1cc(NC(=O)N(CCN2CCCC2)c2ccc(cc2)-c2cccc(c2)C#N)ccc1C(F)(F)F
InChI Key: InChIKey=XEZTZOZLTARYHV-UHFFFAOYSA-N
Data: 1 KI  1 IC50
Activity Spreadsheet -- Enzyme Inhibition Constant Data from BindingDB
Found 2 hits for monomerid = 50170613
Trg + Lig
Ki
nM
ΔG°
kcal/mole
IC50
nM
Kd
nM
EC50/IC50
nM
koff
s-1
kon
M-1s-1
pHTemp
°C
Melanin-concentrating hormone receptor 1
(Homo sapiens (Human))
BDBM50170613
(1-(3'-Cyano-biphenyl-4-yl)-3-(3-fluoro-4-trifluoro...)
Show SMILES Fc1cc(NC(=O)N(CCN2CCCC2)c2ccc(cc2)-c2cccc(c2)C#N)ccc1C(F)(F)F
Show InChI InChI=1S/C27H24F4N4O/c28-25-17-22(8-11-24(25)27(29,30)31)33-26(36)35(15-14-34-12-1-2-13-34)23-9-6-20(7-10-23)21-5-3-4-19(16-21)18-32/h3-11,16-17H,1-2,12-15H2,(H,33,36)
Reactome pathway
5.60n/an/an/an/an/an/an/an/a
Schering-Plough Research Institute
Curated by ChEMBL
Assay Description
Inhibition of human melanin concentrating hormone receptor 1
J Med Chem 48: 4746-9 (2005)
Article DOI: 10.1021/jm0503852
BindingDB Entry DOI: 10.7270/Q2P55N26
Melanin-concentrating hormone receptor 1
(Homo sapiens (Human))
BDBM50170613
(1-(3'-Cyano-biphenyl-4-yl)-3-(3-fluoro-4-trifluoro...)
Show SMILES Fc1cc(NC(=O)N(CCN2CCCC2)c2ccc(cc2)-c2cccc(c2)C#N)ccc1C(F)(F)F
Show InChI InChI=1S/C27H24F4N4O/c28-25-17-22(8-11-24(25)27(29,30)31)33-26(36)35(15-14-34-12-1-2-13-34)23-9-6-20(7-10-23)21-5-3-4-19(16-21)18-32/h3-11,16-17H,1-2,12-15H2,(H,33,36)
Reactome pathway
n/an/a 5.20n/an/an/an/an/an/a
University of Science and Technology
Curated by ChEMBL
Assay Description
Antagonist activity at MCHR1 (unknown origin) expressed in CHO cells co-expressing aequorin incubated for 10 mins by luminescence assay
Bioorg Med Chem Lett 29: (2019)
Article DOI: 10.1016/j.bmcl.2019.126741