BDBM50170814 (1R,4R,5R)-3-Furan-3-yl-1,4,5-trihydroxy-cyclohex-2-enecarboxylic acid::CHEMBL365959
SMILES: O[C@@H]1C[C@@](O)(C=C([C@H]1O)c1ccoc1)C(O)=O
InChI Key: InChIKey=NCNFPCUXYZKRRC-KKZNHRDASA-N
Data: 1 KI
Activity Spreadsheet -- Enzyme Inhibition Constant Data from BindingDB
Found 1 hit for monomerid = 50170814
Trg + Lig
Ki
nM
ΔG°
kcal/mole
IC50
nM
Kd
nM
EC50/IC50
nM
koff
s-1
kon
M-1s-1
pHTemp
°C
3-dehydroquinate dehydratase
(Mycobacterium tuberculosis)
BDBM50170814
((1R,4R,5R)-3-Furan-3-yl-1,4,5-trihydroxy-cyclohex-...)
Show SMILES O[C@@H]1C[C@@](O)(C=C([C@H]1O)c1ccoc1)C(O)=O |c:5|
Show InChI InChI=1S/C11H12O6/c12-8-4-11(16,10(14)15)3-7(9(8)13)6-1-2-17-5-6/h1-3,5,8-9,12-13,16H,4H2,(H,14,15)/t8-,9-,11+/m1/s1
Reactome pathway
830n/an/an/an/an/an/a8.2n/a
Universidad de Santiago de Compostela
Curated by ChEMBL
Assay Description
Inhibition of Mycobacterium tuberculosis type II dehydroquinase at 25 degree C pH 8.2
J Med Chem 48: 4871-81 (2005)
Article DOI: 10.1021/jm0501836
BindingDB Entry DOI: 10.7270/Q2RX9BMC