BDBM50170921 CHEMBL3806023
SMILES: Cc1nnc2ncc3CN(Cc3n12)[C@H]1CC[C@@H]([C@@H](N)C1)c1cc(F)c(F)cc1F
InChI Key: InChIKey=BODWWFCPUUAGKO-JCGVRSQUSA-N
Data: 3 IC50
Activity Spreadsheet -- Enzyme Inhibition Constant Data from BindingDB
Found 3 hits for monomerid = 50170921
Trg + Lig
Ki
nM
ΔG°
kcal/mole
IC50
nM
Kd
nM
EC50/IC50
nM
koff
s-1
kon
M-1s-1
pHTemp
°C
Dipeptidyl peptidase VIII
(Homo sapiens (Human))
BDBM50170921
(CHEMBL3806023)
Show SMILES Cc1nnc2ncc3CN(Cc3n12)[C@H]1CC[C@@H]([C@@H](N)C1)c1cc(F)c(F)cc1F |r|
Show InChI InChI=1S/C20H21F3N6/c1-10-26-27-20-25-7-11-8-28(9-19(11)29(10)20)12-2-3-13(18(24)4-12)14-5-16(22)17(23)6-15(14)21/h5-7,12-13,18H,2-4,8-9,24H2,1H3/t12-,13+,18-/m0/s1
n/an/a 8.10E+3n/an/an/an/an/an/a
Merck Research Laboratories
Curated by ChEMBL
Assay Description
Inhibition of DPP8 (unknown origin)
Bioorg Med Chem Lett 26: 2622-6 (2016)
BindingDB Entry DOI: 10.7270/Q2Z321JP
Lysosomal phospholipase A1
(Rattus norvegicus)
BDBM50170921
(CHEMBL3806023)
Show SMILES Cc1nnc2ncc3CN(Cc3n12)[C@H]1CC[C@@H]([C@@H](N)C1)c1cc(F)c(F)cc1F |r|
Show InChI InChI=1S/C20H21F3N6/c1-10-26-27-20-25-7-11-8-28(9-19(11)29(10)20)12-2-3-13(18(24)4-12)14-5-16(22)17(23)6-15(14)21/h5-7,12-13,18H,2-4,8-9,24H2,1H3/t12-,13+,18-/m0/s1
Reactome pathway
n/an/a 280n/an/an/an/an/an/a
Merck Research Laboratories
Curated by ChEMBL
Assay Description
Inhibition of human FAP
Bioorg Med Chem Lett 26: 2622-6 (2016)
BindingDB Entry DOI: 10.7270/Q2Z321JP
Dipeptidyl peptidase 4
(Homo sapiens (Human))
BDBM50170921
(CHEMBL3806023)
Show SMILES Cc1nnc2ncc3CN(Cc3n12)[C@H]1CC[C@@H]([C@@H](N)C1)c1cc(F)c(F)cc1F |r|
Show InChI InChI=1S/C20H21F3N6/c1-10-26-27-20-25-7-11-8-28(9-19(11)29(10)20)12-2-3-13(18(24)4-12)14-5-16(22)17(23)6-15(14)21/h5-7,12-13,18H,2-4,8-9,24H2,1H3/t12-,13+,18-/m0/s1
Reactome pathway
n/an/a 0.560n/an/an/an/an/an/a
Merck Research Laboratories
Curated by ChEMBL
Assay Description
Inhibition of human DPP4
Bioorg Med Chem Lett 26: 2622-6 (2016)
BindingDB Entry DOI: 10.7270/Q2Z321JP