BDBM50170923 CHEMBL3806041
SMILES: N[C@H]1C[C@H](CC[C@@H]1c1cc(F)c(F)cc1F)N1Cc2cnc3nnc(C4CC4)n3c2C1
InChI Key: InChIKey=HFUIIUHINNYZIC-KSMMKXTCSA-N
Data: 7 IC50
Activity Spreadsheet -- Enzyme Inhibition Constant Data from BindingDB
Found 7 hits for monomerid = 50170923
Trg + Lig
Ki
nM
ΔG°
kcal/mole
IC50
nM
Kd
nM
EC50/IC50
nM
koff
s-1
kon
M-1s-1
pHTemp
°C
1,3-beta-glucan synthase component GLS2
(Saccharomyces cerevisiae)
BDBM50170923
(CHEMBL3806041)
Show SMILES N[C@H]1C[C@H](CC[C@@H]1c1cc(F)c(F)cc1F)N1Cc2cnc3nnc(C4CC4)n3c2C1 |r|
Show InChI InChI=1S/C22H23F3N6/c23-16-7-18(25)17(24)6-15(16)14-4-3-13(5-19(14)26)30-9-12-8-27-22-29-28-21(11-1-2-11)31(22)20(12)10-30/h6-8,11,13-14,19H,1-5,9-10,26H2/t13-,14+,19-/m0/s1
n/an/a 600n/an/an/an/an/an/a
Merck Research Laboratories
Curated by ChEMBL
Assay Description
Inhibition of human ERG
Bioorg Med Chem Lett 26: 2622-6 (2016)
BindingDB Entry DOI: 10.7270/Q2Z321JP
Cytochrome P450 2D6
(Homo sapiens (Human))
BDBM50170923
(CHEMBL3806041)
Show SMILES N[C@H]1C[C@H](CC[C@@H]1c1cc(F)c(F)cc1F)N1Cc2cnc3nnc(C4CC4)n3c2C1 |r|
Show InChI InChI=1S/C22H23F3N6/c23-16-7-18(25)17(24)6-15(16)14-4-3-13(5-19(14)26)30-9-12-8-27-22-29-28-21(11-1-2-11)31(22)20(12)10-30/h6-8,11,13-14,19H,1-5,9-10,26H2/t13-,14+,19-/m0/s1
n/an/a 1.90E+4n/an/an/an/an/an/a
Merck Research Laboratories
Curated by ChEMBL
Assay Description
Inhibition of CYP2D6 (unknown origin)
Bioorg Med Chem Lett 26: 2622-6 (2016)
BindingDB Entry DOI: 10.7270/Q2Z321JP
Cytochrome P450 3A4
(Homo sapiens (Human))
BDBM50170923
(CHEMBL3806041)
Show SMILES N[C@H]1C[C@H](CC[C@@H]1c1cc(F)c(F)cc1F)N1Cc2cnc3nnc(C4CC4)n3c2C1 |r|
Show InChI InChI=1S/C22H23F3N6/c23-16-7-18(25)17(24)6-15(16)14-4-3-13(5-19(14)26)30-9-12-8-27-22-29-28-21(11-1-2-11)31(22)20(12)10-30/h6-8,11,13-14,19H,1-5,9-10,26H2/t13-,14+,19-/m0/s1
Reactome pathway
n/an/a>5.00E+4n/an/an/an/an/an/a
Merck Research Laboratories
Curated by ChEMBL
Assay Description
Inhibition of CYP3A4 (unknown origin)
Bioorg Med Chem Lett 26: 2622-6 (2016)
BindingDB Entry DOI: 10.7270/Q2Z321JP
Lysosomal phospholipase A1
(Rattus norvegicus)
BDBM50170923
(CHEMBL3806041)
Show SMILES N[C@H]1C[C@H](CC[C@@H]1c1cc(F)c(F)cc1F)N1Cc2cnc3nnc(C4CC4)n3c2C1 |r|
Show InChI InChI=1S/C22H23F3N6/c23-16-7-18(25)17(24)6-15(16)14-4-3-13(5-19(14)26)30-9-12-8-27-22-29-28-21(11-1-2-11)31(22)20(12)10-30/h6-8,11,13-14,19H,1-5,9-10,26H2/t13-,14+,19-/m0/s1
Reactome pathway
n/an/a 280n/an/an/an/an/an/a
Merck Research Laboratories
Curated by ChEMBL
Assay Description
Inhibition of human FAP
Bioorg Med Chem Lett 26: 2622-6 (2016)
BindingDB Entry DOI: 10.7270/Q2Z321JP
Dipeptidyl peptidase VIII
(Homo sapiens (Human))
BDBM50170923
(CHEMBL3806041)
Show SMILES N[C@H]1C[C@H](CC[C@@H]1c1cc(F)c(F)cc1F)N1Cc2cnc3nnc(C4CC4)n3c2C1 |r|
Show InChI InChI=1S/C22H23F3N6/c23-16-7-18(25)17(24)6-15(16)14-4-3-13(5-19(14)26)30-9-12-8-27-22-29-28-21(11-1-2-11)31(22)20(12)10-30/h6-8,11,13-14,19H,1-5,9-10,26H2/t13-,14+,19-/m0/s1
n/an/a 3.00E+3n/an/an/an/an/an/a
Merck Research Laboratories
Curated by ChEMBL
Assay Description
Inhibition of DPP8 (unknown origin)
Bioorg Med Chem Lett 26: 2622-6 (2016)
BindingDB Entry DOI: 10.7270/Q2Z321JP
Dipeptidyl peptidase 4
(Homo sapiens (Human))
BDBM50170923
(CHEMBL3806041)
Show SMILES N[C@H]1C[C@H](CC[C@@H]1c1cc(F)c(F)cc1F)N1Cc2cnc3nnc(C4CC4)n3c2C1 |r|
Show InChI InChI=1S/C22H23F3N6/c23-16-7-18(25)17(24)6-15(16)14-4-3-13(5-19(14)26)30-9-12-8-27-22-29-28-21(11-1-2-11)31(22)20(12)10-30/h6-8,11,13-14,19H,1-5,9-10,26H2/t13-,14+,19-/m0/s1
Reactome pathway
n/an/a 0.240n/an/an/an/an/an/a
Merck Research Laboratories
Curated by ChEMBL
Assay Description
Inhibition of human DPP4
Bioorg Med Chem Lett 26: 2622-6 (2016)
BindingDB Entry DOI: 10.7270/Q2Z321JP
Cytochrome P450 2C9
(Homo sapiens (Human))
BDBM50170923
(CHEMBL3806041)
Show SMILES N[C@H]1C[C@H](CC[C@@H]1c1cc(F)c(F)cc1F)N1Cc2cnc3nnc(C4CC4)n3c2C1 |r|
Show InChI InChI=1S/C22H23F3N6/c23-16-7-18(25)17(24)6-15(16)14-4-3-13(5-19(14)26)30-9-12-8-27-22-29-28-21(11-1-2-11)31(22)20(12)10-30/h6-8,11,13-14,19H,1-5,9-10,26H2/t13-,14+,19-/m0/s1
Reactome pathway
n/an/a>5.00E+4n/an/an/an/an/an/a
Merck Research Laboratories
Curated by ChEMBL
Assay Description
Inhibition of CYP2C9 (unknown origin)
Bioorg Med Chem Lett 26: 2622-6 (2016)
BindingDB Entry DOI: 10.7270/Q2Z321JP