BDBM50170928 CHEMBL3806239
SMILES: Cc1ccn2nc3CN(Cc3c2n1)[C@H]1CC[C@@H]([C@@H](N)C1)c1cc(F)c(F)cc1F
InChI Key: InChIKey=JFPRYAZBGQMKNO-QUJCMNEKSA-N
Data: 3 IC50
Activity Spreadsheet -- Enzyme Inhibition Constant Data from BindingDB
Found 3 hits for monomerid = 50170928
Trg + Lig
Ki
nM
ΔG°
kcal/mole
IC50
nM
Kd
nM
EC50/IC50
nM
koff
s-1
kon
M-1s-1
pHTemp
°C
Dipeptidyl peptidase VIII
(Homo sapiens (Human))
BDBM50170928
(CHEMBL3806239)
Show SMILES Cc1ccn2nc3CN(Cc3c2n1)[C@H]1CC[C@@H]([C@@H](N)C1)c1cc(F)c(F)cc1F |r|
Show InChI InChI=1S/C21H22F3N5/c1-11-4-5-29-21(26-11)15-9-28(10-20(15)27-29)12-2-3-13(19(25)6-12)14-7-17(23)18(24)8-16(14)22/h4-5,7-8,12-13,19H,2-3,6,9-10,25H2,1H3/t12-,13+,19-/m0/s1
n/an/a 4.20E+4n/an/an/an/an/an/a
Merck Research Laboratories
Curated by ChEMBL
Assay Description
Inhibition of DPP8 (unknown origin)
Bioorg Med Chem Lett 26: 2622-6 (2016)
BindingDB Entry DOI: 10.7270/Q2Z321JP
Lysosomal phospholipase A1
(Rattus norvegicus)
BDBM50170928
(CHEMBL3806239)
Show SMILES Cc1ccn2nc3CN(Cc3c2n1)[C@H]1CC[C@@H]([C@@H](N)C1)c1cc(F)c(F)cc1F |r|
Show InChI InChI=1S/C21H22F3N5/c1-11-4-5-29-21(26-11)15-9-28(10-20(15)27-29)12-2-3-13(19(25)6-12)14-7-17(23)18(24)8-16(14)22/h4-5,7-8,12-13,19H,2-3,6,9-10,25H2,1H3/t12-,13+,19-/m0/s1
Reactome pathway
n/an/a 1.80E+3n/an/an/an/an/an/a
Merck Research Laboratories
Curated by ChEMBL
Assay Description
Inhibition of human FAP
Bioorg Med Chem Lett 26: 2622-6 (2016)
BindingDB Entry DOI: 10.7270/Q2Z321JP
Dipeptidyl peptidase 4
(Homo sapiens (Human))
BDBM50170928
(CHEMBL3806239)
Show SMILES Cc1ccn2nc3CN(Cc3c2n1)[C@H]1CC[C@@H]([C@@H](N)C1)c1cc(F)c(F)cc1F |r|
Show InChI InChI=1S/C21H22F3N5/c1-11-4-5-29-21(26-11)15-9-28(10-20(15)27-29)12-2-3-13(19(25)6-12)14-7-17(23)18(24)8-16(14)22/h4-5,7-8,12-13,19H,2-3,6,9-10,25H2,1H3/t12-,13+,19-/m0/s1
Reactome pathway
n/an/a 155n/an/an/an/an/an/a
Merck Research Laboratories
Curated by ChEMBL
Assay Description
Inhibition of human DPP4
Bioorg Med Chem Lett 26: 2622-6 (2016)
BindingDB Entry DOI: 10.7270/Q2Z321JP