BDBM50170953 CHEMBL3805154
SMILES: Cc1cc(O)n2nc3CN(Cc3c2n1)[C@H]1CO[C@@H]([C@@H](N)C1)c1cc(F)c(F)cc1F
InChI Key: InChIKey=WUGCBDASWSNLFX-ULMSCDGUSA-N
Data: 3 IC50
Activity Spreadsheet -- Enzyme Inhibition Constant Data from BindingDB
Found 3 hits for monomerid = 50170953
Trg + Lig
Ki
nM
ΔG°
kcal/mole
IC50
nM
Kd
nM
EC50/IC50
nM
koff
s-1
kon
M-1s-1
pHTemp
°C
Lysosomal phospholipase A1
(Rattus norvegicus)
BDBM50170953
(CHEMBL3805154)
Show SMILES Cc1cc(O)n2nc3CN(Cc3c2n1)[C@H]1CO[C@@H]([C@@H](N)C1)c1cc(F)c(F)cc1F |r|
Show InChI InChI=1S/C20H20F3N5O2/c1-9-2-18(29)28-20(25-9)12-6-27(7-17(12)26-28)10-3-16(24)19(30-8-10)11-4-14(22)15(23)5-13(11)21/h2,4-5,10,16,19,29H,3,6-8,24H2,1H3/t10-,16+,19-/m1/s1
Reactome pathway
n/an/a 5.50E+4n/an/an/an/an/an/a
Merck Research Laboratories
Curated by ChEMBL
Assay Description
Inhibition of human FAP
Bioorg Med Chem Lett 26: 2622-6 (2016)
BindingDB Entry DOI: 10.7270/Q2Z321JP
Dipeptidyl peptidase VIII
(Homo sapiens (Human))
BDBM50170953
(CHEMBL3805154)
Show SMILES Cc1cc(O)n2nc3CN(Cc3c2n1)[C@H]1CO[C@@H]([C@@H](N)C1)c1cc(F)c(F)cc1F |r|
Show InChI InChI=1S/C20H20F3N5O2/c1-9-2-18(29)28-20(25-9)12-6-27(7-17(12)26-28)10-3-16(24)19(30-8-10)11-4-14(22)15(23)5-13(11)21/h2,4-5,10,16,19,29H,3,6-8,24H2,1H3/t10-,16+,19-/m1/s1
n/an/a 1.00E+5n/an/an/an/an/an/a
Merck Research Laboratories
Curated by ChEMBL
Assay Description
Inhibition of DPP8 (unknown origin)
Bioorg Med Chem Lett 26: 2622-6 (2016)
BindingDB Entry DOI: 10.7270/Q2Z321JP
Dipeptidyl peptidase 4
(Homo sapiens (Human))
BDBM50170953
(CHEMBL3805154)
Show SMILES Cc1cc(O)n2nc3CN(Cc3c2n1)[C@H]1CO[C@@H]([C@@H](N)C1)c1cc(F)c(F)cc1F |r|
Show InChI InChI=1S/C20H20F3N5O2/c1-9-2-18(29)28-20(25-9)12-6-27(7-17(12)26-28)10-3-16(24)19(30-8-10)11-4-14(22)15(23)5-13(11)21/h2,4-5,10,16,19,29H,3,6-8,24H2,1H3/t10-,16+,19-/m1/s1
Reactome pathway
n/an/a 0.5n/an/an/an/an/an/a
Merck Research Laboratories
Curated by ChEMBL
Assay Description
Inhibition of human DPP4
Bioorg Med Chem Lett 26: 2622-6 (2016)
BindingDB Entry DOI: 10.7270/Q2Z321JP