BDBM50171158 (3S,4aR,4bS,6S,8R,8aR,10aR)-6-Acetoxy-3-furan-3-yl-4a,8a-dimethyl-1,5-dioxo-dodecahydro-2-oxa-phenanthrene-8-carboxylic acid benzyl ester::CHEMBL194264
SMILES: CC(=O)O[C@H]1C[C@@H](C(=O)OCc2ccccc2)[C@]2(C)CC[C@H]3C(=O)O[C@@H](C[C@]3(C)[C@H]2C1=O)c1ccoc1
InChI Key: InChIKey=QVVBEGSRBOZGJL-ZZIVESEQSA-N
Data: 1 KI
Activity Spreadsheet -- Enzyme Inhibition Constant Data from BindingDB
Found 1 hit for monomerid = 50171158
Trg + Lig
Ki
nM
ΔG°
kcal/mole
IC50
nM
Kd
nM
EC50/IC50
nM
koff
s-1
kon
M-1s-1
pHTemp
°C
Kappa-type opioid receptor
(Homo sapiens (Human))
BDBM50171158
((3S,4aR,4bS,6S,8R,8aR,10aR)-6-Acetoxy-3-furan-3-yl...)
Show SMILES CC(=O)O[C@H]1C[C@@H](C(=O)OCc2ccccc2)[C@]2(C)CC[C@H]3C(=O)O[C@@H](C[C@]3(C)[C@H]2C1=O)c1ccoc1
Show InChI InChI=1S/C29H32O8/c1-17(30)36-22-13-21(26(32)35-15-18-7-5-4-6-8-18)28(2)11-9-20-27(33)37-23(19-10-12-34-16-19)14-29(20,3)25(28)24(22)31/h4-8,10,12,16,20-23,25H,9,11,13-15H2,1-3H3/t20-,21-,22-,23-,25-,28-,29-/m0/s1
Reactome pathway
>1.00E+3n/an/an/an/an/an/an/an/a
Harvard Medical School
Curated by ChEMBL
Assay Description
Binding affinity for 1 uM [3H]-diprenorphine against human Opioid receptor kappa expressed in chinese hamster ovary cells (CHO cells)
Bioorg Med Chem Lett 15: 4169-73 (2005)
Article DOI: 10.1016/j.bmcl.2005.06.092
BindingDB Entry DOI: 10.7270/Q2BP02BX