BDBM50171298 CHEMBL286321::Hexadecanoylamino-acetic acid methyl ester
SMILES: CCCCCCCCCCCCCCCC(=O)NCC(=O)OC
InChI Key: InChIKey=NRBKZOKUPJQKRF-UHFFFAOYSA-N
Data: 1 IC50
Activity Spreadsheet -- Enzyme Inhibition Constant Data from BindingDB
Found 1 hit for monomerid = 50171298
Trg + Lig
Ki
nM
ΔG°
kcal/mole
IC50
nM
Kd
nM
EC50/IC50
nM
koff
s-1
kon
M-1s-1
pHTemp
°C
Fatty-acid amide hydrolase 1
(Homo sapiens (Human))
BDBM50171298
(CHEMBL286321 | Hexadecanoylamino-acetic acid methy...)
Show SMILES CCCCCCCCCCCCCCCC(=O)NCC(=O)OC
Show InChI InChI=1S/C19H37NO3/c1-3-4-5-6-7-8-9-10-11-12-13-14-15-16-18(21)20-17-19(22)23-2/h3-17H2,1-2H3,(H,20,21)
n/an/a 1.00E+4n/an/an/an/an/an/a
Universit£ Catholique de Louvain
Curated by ChEMBL
Assay Description
Inhibitory concentration against fatty acid amide hydrolase
J Med Chem 48: 5059-87 (2005)
Article DOI: 10.1021/jm058183t
BindingDB Entry DOI: 10.7270/Q2J96753