BDBM50171645 2-Cyclodecylamino-1-pyrrolidin-1-yl--2-borandihydroxy-ethanone::CHEMBL196267
SMILES: OB(O)[C@@H]1CCCN1C(=O)CNC1CCCCCCCCC1
InChI Key: InChIKey=SWAHNRUQLSQRJA-HNNXBMFYSA-N
Data: 3 IC50
Activity Spreadsheet -- Enzyme Inhibition Constant Data from BindingDB
Found 3 hits for monomerid = 50171645
Trg + Lig
Ki
nM
ΔG°
kcal/mole
IC50
nM
Kd
nM
EC50/IC50
nM
koff
s-1
kon
M-1s-1
pHTemp
°C
Fibroblast activation protein alpha
(Homo sapiens (Human))
BDBM50171645
(2-Cyclodecylamino-1-pyrrolidin-1-yl--2-borandihydr...)
Show SMILES OB(O)[C@@H]1CCCN1C(=O)CNC1CCCCCCCCC1
Show InChI InChI=1S/C16H31BN2O3/c20-16(19-12-8-11-15(19)17(21)22)13-18-14-9-6-4-2-1-3-5-7-10-14/h14-15,18,21-22H,1-13H2/t15-/m0/s1
n/an/a 530n/an/an/an/an/an/a
ActivX Biosciences, Inc.
Curated by ChEMBL
Assay Description
Inhibitory activity against human FAP using Lys-Pro-AMC in fluorometric assay
Bioorg Med Chem Lett 15: 4239-42 (2005)
Article DOI: 10.1016/j.bmcl.2005.06.075
BindingDB Entry DOI: 10.7270/Q2CJ8D2F
Dipeptidyl peptidase 4
(Homo sapiens (Human))
BDBM50171645
(2-Cyclodecylamino-1-pyrrolidin-1-yl--2-borandihydr...)
Show SMILES OB(O)[C@@H]1CCCN1C(=O)CNC1CCCCCCCCC1
Show InChI InChI=1S/C16H31BN2O3/c20-16(19-12-8-11-15(19)17(21)22)13-18-14-9-6-4-2-1-3-5-7-10-14/h14-15,18,21-22H,1-13H2/t15-/m0/s1
Reactome pathway
n/an/a 58n/an/an/an/an/an/a
ActivX Biosciences, Inc.
Curated by ChEMBL
Assay Description
Inhibitory activity against human DPP4 using Gly-Pro-AMC in fluorometric assay
Bioorg Med Chem Lett 15: 4239-42 (2005)
Article DOI: 10.1016/j.bmcl.2005.06.075
BindingDB Entry DOI: 10.7270/Q2CJ8D2F
Dipeptidyl peptidase 2 (DPP II)
(Homo sapiens (Human))
BDBM50171645
(2-Cyclodecylamino-1-pyrrolidin-1-yl--2-borandihydr...)
Show SMILES OB(O)[C@@H]1CCCN1C(=O)CNC1CCCCCCCCC1
Show InChI InChI=1S/C16H31BN2O3/c20-16(19-12-8-11-15(19)17(21)22)13-18-14-9-6-4-2-1-3-5-7-10-14/h14-15,18,21-22H,1-13H2/t15-/m0/s1
n/an/a 2.20n/an/an/an/an/an/a
ActivX Biosciences, Inc.
Curated by ChEMBL
Assay Description
Inhibitory activity against human DPP7 using Ala-Pro-AMC in fluorometric assay
Bioorg Med Chem Lett 15: 4239-42 (2005)
Article DOI: 10.1016/j.bmcl.2005.06.075
BindingDB Entry DOI: 10.7270/Q2CJ8D2F