null
SMILES: CCN1c2ncc(CCOc3ccc(cc3C)C(O)=O)cc2C(=O)N(C)c2ccc(Cl)nc12
InChI Key: InChIKey=GJOFKXMSOUVAMX-UHFFFAOYSA-N
Activity Spreadsheet -- Enzyme Inhibition Constant Data from BindingDB
Found 4 hits for monomerid = 50171982
Trg + Lig
Ki
nM
ΔG°
kcal/mole
IC50
nM
Kd
nM
EC50/IC50
nM
koff
s-1
kon
M-1s-1
pHTemp
°C
Reverse transcriptase/RNaseH
(Human immunodeficiency virus 1)
BDBM50171982
(4-[2-(7-Chloro-5-ethyl-10-methyl-11-oxo-10,11-dihy...)
Show SMILES CCN1c2ncc(CCOc3ccc(cc3C)C(O)=O)cc2C(=O)N(C)c2ccc(Cl)nc12
Show InChI InChI=1S/C24H23ClN4O4/c1-4-29-21-17(23(30)28(3)18-6-8-20(25)27-22(18)29)12-15(13-26-21)9-10-33-19-7-5-16(24(31)32)11-14(19)2/h5-8,11-13H,4,9-10H2,1-3H3,(H,31,32)
n/an/an/an/a 8.10n/an/an/an/a
Boehringer Ingelheim (Canada) Ltd.
Curated by ChEMBL
Assay Description
Effective concentration of the compound towards HIV-1 K103N/Y181C mutant reverse transcriptase activity by 50% measured in cellular assay
J Med Chem 48: 5580-8 (2005)
Article DOI: 10.1021/jm050255t
BindingDB Entry DOI: 10.7270/Q29K49RC
Reverse transcriptase/RNaseH
(Human immunodeficiency virus 1)
BDBM50171982
(4-[2-(7-Chloro-5-ethyl-10-methyl-11-oxo-10,11-dihy...)
Show SMILES CCN1c2ncc(CCOc3ccc(cc3C)C(O)=O)cc2C(=O)N(C)c2ccc(Cl)nc12
Show InChI InChI=1S/C24H23ClN4O4/c1-4-29-21-17(23(30)28(3)18-6-8-20(25)27-22(18)29)12-15(13-26-21)9-10-33-19-7-5-16(24(31)32)11-14(19)2/h5-8,11-13H,4,9-10H2,1-3H3,(H,31,32)
n/an/a 10n/an/an/an/a7.8n/a
Boehringer Ingelheim (Canada) Ltd.
Curated by ChEMBL
Assay Description
Inhibitory activity of compound dissolved in DMSO was determined against HIV-1 wild type reverse transcriptase (1-2 nM) by using [3H]-dGTP (71 nM) a...
J Med Chem 48: 5580-8 (2005)
Article DOI: 10.1021/jm050255t
BindingDB Entry DOI: 10.7270/Q29K49RC
Reverse transcriptase/RNaseH
(Human immunodeficiency virus 1)
BDBM50171982
(4-[2-(7-Chloro-5-ethyl-10-methyl-11-oxo-10,11-dihy...)
Show SMILES CCN1c2ncc(CCOc3ccc(cc3C)C(O)=O)cc2C(=O)N(C)c2ccc(Cl)nc12
Show InChI InChI=1S/C24H23ClN4O4/c1-4-29-21-17(23(30)28(3)18-6-8-20(25)27-22(18)29)12-15(13-26-21)9-10-33-19-7-5-16(24(31)32)11-14(19)2/h5-8,11-13H,4,9-10H2,1-3H3,(H,31,32)
n/an/a 64n/an/an/an/a7.8n/a
Boehringer Ingelheim (Canada) Ltd.
Curated by ChEMBL
Assay Description
Inhibitory activity of compound dissolved in DMSO was determined against HIV-1 (K103N/Y181C) mutant reverse transcriptase (1-2 nM) by using [3H]-dGTP...
J Med Chem 48: 5580-8 (2005)
Article DOI: 10.1021/jm050255t
BindingDB Entry DOI: 10.7270/Q29K49RC
Reverse transcriptase/RNaseH
(Human immunodeficiency virus 1)
BDBM50171982
(4-[2-(7-Chloro-5-ethyl-10-methyl-11-oxo-10,11-dihy...)
Show SMILES CCN1c2ncc(CCOc3ccc(cc3C)C(O)=O)cc2C(=O)N(C)c2ccc(Cl)nc12
Show InChI InChI=1S/C24H23ClN4O4/c1-4-29-21-17(23(30)28(3)18-6-8-20(25)27-22(18)29)12-15(13-26-21)9-10-33-19-7-5-16(24(31)32)11-14(19)2/h5-8,11-13H,4,9-10H2,1-3H3,(H,31,32)
n/an/an/an/a 1.60n/an/an/an/a
Boehringer Ingelheim (Canada) Ltd.
Curated by ChEMBL
Assay Description
Effective concentration towards HIV-1 wild type reverse transcriptase activity by 50% measured in cellular assay
J Med Chem 48: 5580-8 (2005)
Article DOI: 10.1021/jm050255t
BindingDB Entry DOI: 10.7270/Q29K49RC