BDBM50172032 2-Benzyl-2-hydroxy-4-methyl-4-phenyl-pentanoic acid (4-methyl-1-oxo-1H-benzo[d][1,2]oxazin-6-yl)-amide::CHEMBL363200
SMILES: Cc1noc(=O)c2ccc(NC(=O)C(O)(Cc3ccccc3)CC(C)(C)c3ccccc3)cc12
InChI Key: InChIKey=DXVZGTRLQAZISS-UHFFFAOYSA-N
Data: 2 IC50
Activity Spreadsheet -- Enzyme Inhibition Constant Data from BindingDB
Found 2 hits for monomerid = 50172032
Trg + Lig
Ki
nM
ΔG°
kcal/mole
IC50
nM
Kd
nM
EC50/IC50
nM
koff
s-1
kon
M-1s-1
pHTemp
°C
Glucocorticoid receptor
(Homo sapiens (Human))
BDBM50172032
(2-Benzyl-2-hydroxy-4-methyl-4-phenyl-pentanoic aci...)
Show SMILES Cc1noc(=O)c2ccc(NC(=O)C(O)(Cc3ccccc3)CC(C)(C)c3ccccc3)cc12
Show InChI InChI=1S/C28H28N2O4/c1-19-24-16-22(14-15-23(24)25(31)34-30-19)29-26(32)28(33,17-20-10-6-4-7-11-20)18-27(2,3)21-12-8-5-9-13-21/h4-16,33H,17-18H2,1-3H3,(H,29,32)
n/an/a 7n/an/an/an/an/an/a
Boehringer Ingelheim Pharmaceuticals Inc.
Curated by ChEMBL
Assay Description
Binding affinity towards glucocorticoid receptor using fluorescence polarization competitive binding assay
Bioorg Med Chem Lett 15: 4761-9 (2005)
Article DOI: 10.1016/j.bmcl.2005.07.025
BindingDB Entry DOI: 10.7270/Q24T6K5P
Progesterone receptor
(Homo sapiens (Human))
BDBM50172032
(2-Benzyl-2-hydroxy-4-methyl-4-phenyl-pentanoic aci...)
Show SMILES Cc1noc(=O)c2ccc(NC(=O)C(O)(Cc3ccccc3)CC(C)(C)c3ccccc3)cc12
Show InChI InChI=1S/C28H28N2O4/c1-19-24-16-22(14-15-23(24)25(31)34-30-19)29-26(32)28(33,17-20-10-6-4-7-11-20)18-27(2,3)21-12-8-5-9-13-21/h4-16,33H,17-18H2,1-3H3,(H,29,32)
n/an/a 30n/an/an/an/an/an/a
Boehringer Ingelheim Pharmaceuticals Inc.
Curated by ChEMBL
Assay Description
Binding affinity towards progesterone receptor using fluorescence polarization competitive binding assay
Bioorg Med Chem Lett 15: 4761-9 (2005)
Article DOI: 10.1016/j.bmcl.2005.07.025
BindingDB Entry DOI: 10.7270/Q24T6K5P