BDBM50172126 2-[1-(Toluene-3-sulfonyl)-1,2,3,6-tetrahydro-pyridin-4-ylethynyl]-pyridine::CHEMBL195944
SMILES: Cc1cccc(c1)S(=O)(=O)N1CCC(=CC1)C#Cc1ccccn1
InChI Key: InChIKey=ULGOEAHHQNZHTC-UHFFFAOYSA-N
Data: 1 KI  2 IC50
Activity Spreadsheet -- Enzyme Inhibition Constant Data from BindingDB
Found 3 hits for monomerid = 50172126
Trg + Lig
Ki
nM
ΔG°
kcal/mole
IC50
nM
Kd
nM
EC50/IC50
nM
koff
s-1
kon
M-1s-1
pHTemp
°C
Metabotropic glutamate receptor 5
(Rattus norvegicus (Rat))
BDBM50172126
(2-[1-(Toluene-3-sulfonyl)-1,2,3,6-tetrahydro-pyrid...)
Show SMILES Cc1cccc(c1)S(=O)(=O)N1CCC(=CC1)C#Cc1ccccn1 |c:14|
Show InChI InChI=1S/C19H18N2O2S/c1-16-5-4-7-19(15-16)24(22,23)21-13-10-17(11-14-21)8-9-18-6-2-3-12-20-18/h2-7,10,12,15H,11,13-14H2,1H3
Reactome pathway
13n/an/an/an/an/an/an/an/a
Merck Research Laboratories
Curated by ChEMBL
Assay Description
Displacement of [3H]-3-methoxy-5-(pyridin-2-ylethynyl)pyridine from mGlu5 receptor of rat cortical membrane
Bioorg Med Chem Lett 15: 4589-93 (2005)
Article DOI: 10.1016/j.bmcl.2005.06.099
BindingDB Entry DOI: 10.7270/Q2DB81C5
Metabotropic glutamate receptor 5
(Homo sapiens (Human))
BDBM50172126
(2-[1-(Toluene-3-sulfonyl)-1,2,3,6-tetrahydro-pyrid...)
Show SMILES Cc1cccc(c1)S(=O)(=O)N1CCC(=CC1)C#Cc1ccccn1 |c:14|
Show InChI InChI=1S/C19H18N2O2S/c1-16-5-4-7-19(15-16)24(22,23)21-13-10-17(11-14-21)8-9-18-6-2-3-12-20-18/h2-7,10,12,15H,11,13-14H2,1H3
n/an/a 8.20n/an/an/an/an/an/a
Merck Research Laboratories
Curated by ChEMBL
Assay Description
In vitro inhibitory concentration against Ca+2 flux mediated by human mGlu5 receptor expressed in Ltk cells using fura-2 dye
Bioorg Med Chem Lett 15: 4589-93 (2005)
Article DOI: 10.1016/j.bmcl.2005.06.099
BindingDB Entry DOI: 10.7270/Q2DB81C5
Cytochrome P450 1A2
(Homo sapiens (Human))
BDBM50172126
(2-[1-(Toluene-3-sulfonyl)-1,2,3,6-tetrahydro-pyrid...)
Show SMILES Cc1cccc(c1)S(=O)(=O)N1CCC(=CC1)C#Cc1ccccn1 |c:14|
Show InChI InChI=1S/C19H18N2O2S/c1-16-5-4-7-19(15-16)24(22,23)21-13-10-17(11-14-21)8-9-18-6-2-3-12-20-18/h2-7,10,12,15H,11,13-14H2,1H3
Reactome pathway
n/an/a>2.00E+4n/an/an/an/an/an/a
Merck Research Laboratories
Curated by ChEMBL
Assay Description
Inhibitory concentration against CYP1A2 using recombinant CYP450 under Gentest-based protocol
Bioorg Med Chem Lett 15: 4589-93 (2005)
Article DOI: 10.1016/j.bmcl.2005.06.099
BindingDB Entry DOI: 10.7270/Q2DB81C5