BDBM50172241 CHEMBL3810168::US10294221, Example 22(a)
SMILES: CO[C@@H](C(=O)Nc1nnc(N[C@@H]2CCN(C2)c2cncnn2)s1)c1cccc(OC(F)(F)F)c1
InChI Key: InChIKey=MIVIOHXOLBNSSV-IUODEOHRSA-N
Data: 3 IC50
Activity Spreadsheet -- Enzyme Inhibition Constant Data from BindingDB
Found 3 hits for monomerid = 50172241
Trg + Lig
Ki
nM
ΔG°
kcal/mole
IC50
nM
Kd
nM
EC50/IC50
nM
koff
s-1
kon
M-1s-1
pHTemp
°C
Glutaminase kidney isoform, mitochondrial
(Homo sapiens (Human))
BDBM50172241
(CHEMBL3810168 | US10294221, Example 22(a))
Show SMILES CO[C@@H](C(=O)Nc1nnc(N[C@@H]2CCN(C2)c2cncnn2)s1)c1cccc(OC(F)(F)F)c1 |r|
Show InChI InChI=1S/C19H19F3N8O3S/c1-32-15(11-3-2-4-13(7-11)33-19(20,21)22)16(31)26-18-29-28-17(34-18)25-12-5-6-30(9-12)14-8-23-10-24-27-14/h2-4,7-8,10,12,15H,5-6,9H2,1H3,(H,25,28)(H,26,29,31)/t12-,15-/m1/s1
n/an/a 43n/an/an/an/an/an/a
Therachem Research Medilab (India) Pvt. Ltd.
Curated by ChEMBL
Assay Description
Inhibition of 6His-tagged GLS1 (63-669 residues) (unknown origin) expressed in Escherichia coli using glutamine as substrate after 15 mins by Glutama...
ACS Med Chem Lett 7: 207-8 (2016)
BindingDB Entry DOI: 10.7270/Q2GX4DG1
Glutaminase kidney isoform, mitochondrial
(Homo sapiens (Human))
BDBM50172241
(CHEMBL3810168 | US10294221, Example 22(a))
Show SMILES CO[C@@H](C(=O)Nc1nnc(N[C@@H]2CCN(C2)c2cncnn2)s1)c1cccc(OC(F)(F)F)c1 |r|
Show InChI InChI=1S/C19H19F3N8O3S/c1-32-15(11-3-2-4-13(7-11)33-19(20,21)22)16(31)26-18-29-28-17(34-18)25-12-5-6-30(9-12)14-8-23-10-24-27-14/h2-4,7-8,10,12,15H,5-6,9H2,1H3,(H,25,28)(H,26,29,31)/t12-,15-/m1/s1
US Patent
n/an/a 72.9n/an/an/an/an/an/a
Bristol-Myers Squibb Company
Assay Description
A Glutamate Oxidase/AmplexRed coupled assay was used to measure the ability of compounds to bind to and inhibit the activity of GLS1 in vitro. 6His t...
Bioorg Med Chem Lett 18: 1577-82 (2008)
BindingDB Entry DOI: 10.7270/Q2MK6G78
Glutaminase kidney isoform, mitochondrial
(Homo sapiens (Human))
BDBM50172241
(CHEMBL3810168 | US10294221, Example 22(a))
Show SMILES CO[C@@H](C(=O)Nc1nnc(N[C@@H]2CCN(C2)c2cncnn2)s1)c1cccc(OC(F)(F)F)c1 |r|
Show InChI InChI=1S/C19H19F3N8O3S/c1-32-15(11-3-2-4-13(7-11)33-19(20,21)22)16(31)26-18-29-28-17(34-18)25-12-5-6-30(9-12)14-8-23-10-24-27-14/h2-4,7-8,10,12,15H,5-6,9H2,1H3,(H,25,28)(H,26,29,31)/t12-,15-/m1/s1
n/an/a 0.206n/an/an/an/an/an/a
Therachem Research Medilab (India) Pvt. Ltd.
Curated by ChEMBL
Assay Description
Inhibition of GLS1 in human PC3 cells assessed as cellular glutamate depletion levels after 6 hrs by Glutamate Oxidase/ AmplexRed coupled assay
ACS Med Chem Lett 7: 207-8 (2016)
BindingDB Entry DOI: 10.7270/Q2GX4DG1