BDBM50172282 1-(3,4-Dichloro-benzenesulfonyl)-3-((S)-1-methyl-pyrrolidin-2-ylmethyl)-1H-indole::CHEMBL198941
SMILES: CN1CCC[C@H]1Cc1cn(c2ccccc12)S(=O)(=O)c1ccc(Cl)c(Cl)c1
InChI Key: InChIKey=NONBRWFULHRYKS-HNNXBMFYSA-N
Data: 1 KI  1 IC50
Activity Spreadsheet -- Enzyme Inhibition Constant Data from BindingDB
Found 2 hits for monomerid = 50172282
Trg + Lig
Ki
nM
ΔG°
kcal/mole
IC50
nM
Kd
nM
EC50/IC50
nM
koff
s-1
kon
M-1s-1
pHTemp
°C
5-hydroxytryptamine receptor 6
(Homo sapiens (Human))
BDBM50172282
(1-(3,4-Dichloro-benzenesulfonyl)-3-((S)-1-methyl-p...)
Show SMILES CN1CCC[C@H]1Cc1cn(c2ccccc12)S(=O)(=O)c1ccc(Cl)c(Cl)c1
Show InChI InChI=1S/C20H20Cl2N2O2S/c1-23-10-4-5-15(23)11-14-13-24(20-7-3-2-6-17(14)20)27(25,26)16-8-9-18(21)19(22)12-16/h2-3,6-9,12-13,15H,4-5,10-11H2,1H3/t15-/m0/s1
Reactome pathway
12n/an/an/an/an/an/an/an/a
Wyeth Research
Curated by ChEMBL
Assay Description
Displacement of [3H]-LSD from cloned human 5-hydroxytryptamine 6 receptor expressed in HeLa cells
Bioorg Med Chem Lett 15: 4780-5 (2005)
Article DOI: 10.1016/j.bmcl.2005.07.028
BindingDB Entry DOI: 10.7270/Q2RN37DD
5-hydroxytryptamine receptor 6
(Homo sapiens (Human))
BDBM50172282
(1-(3,4-Dichloro-benzenesulfonyl)-3-((S)-1-methyl-p...)
Show SMILES CN1CCC[C@H]1Cc1cn(c2ccccc12)S(=O)(=O)c1ccc(Cl)c(Cl)c1
Show InChI InChI=1S/C20H20Cl2N2O2S/c1-23-10-4-5-15(23)11-14-13-24(20-7-3-2-6-17(14)20)27(25,26)16-8-9-18(21)19(22)12-16/h2-3,6-9,12-13,15H,4-5,10-11H2,1H3/t15-/m0/s1
Reactome pathway
n/an/a 7.30n/an/an/an/an/an/a
Wyeth Research
Curated by ChEMBL
Assay Description
Inhibition of cAMP production in HeLa cells expressing human 5-HT6 receptor
Bioorg Med Chem Lett 15: 4780-5 (2005)
Article DOI: 10.1016/j.bmcl.2005.07.028
BindingDB Entry DOI: 10.7270/Q2RN37DD