BDBM50172328 CHEMBL3810318
SMILES: CN(C)CCCN(C)c1ccc(Nc2cc(NC3CC3)n3ncc(C#N)c3n2)cc1NC(C)=O
InChI Key: InChIKey=CFEUTQZAQQUKNE-UHFFFAOYSA-N
Data: 1 IC50
Activity Spreadsheet -- Enzyme Inhibition Constant Data from BindingDB
Found 1 hit for monomerid = 50172328
Trg + Lig
Ki
nM
ΔG°
kcal/mole
IC50
nM
Kd
nM
EC50/IC50
nM
koff
s-1
kon
M-1s-1
pHTemp
°C
Casein kinase II subunit alpha
(Homo sapiens (Human))
BDBM50172328
(CHEMBL3810318)
Show SMILES CN(C)CCCN(C)c1ccc(Nc2cc(NC3CC3)n3ncc(C#N)c3n2)cc1NC(C)=O
Show InChI InChI=1S/C24H31N9O/c1-16(34)27-20-12-19(8-9-21(20)32(4)11-5-10-31(2)3)28-22-13-23(29-18-6-7-18)33-24(30-22)17(14-25)15-26-33/h8-9,12-13,15,18,29H,5-7,10-11H2,1-4H3,(H,27,34)(H,28,30)
n/an/a 6n/an/an/an/an/an/a
AstraZeneca
Curated by ChEMBL
Assay Description
Inhibition of full length N-terminal 6xHis-tagged recombinant human CK2alpha expressed in fall armyworm Sf21 cells using BODIPY-FL-RRRDDDSDDD-CONH2 a...
ACS Med Chem Lett 7: 300-5 (2016)
BindingDB Entry DOI: 10.7270/Q2C53NRM