BDBM50172330 CHEMBL3809094
SMILES: CN(CCN1CC(F)(F)C1)c1ccc(Nc2cc(NC3CC3)n3ncc(C#N)c3n2)cc1NC(C)=O
InChI Key: InChIKey=IHVQLZGQPCNROR-UHFFFAOYSA-N
Data: 1 IC50
Activity Spreadsheet -- Enzyme Inhibition Constant Data from BindingDB
Found 1 hit for monomerid = 50172330
Trg + Lig
Ki
nM
ΔG°
kcal/mole
IC50
nM
Kd
nM
EC50/IC50
nM
koff
s-1
kon
M-1s-1
pHTemp
°C
Casein kinase II subunit alpha
(Homo sapiens (Human))
BDBM50172330
(CHEMBL3809094)
Show SMILES CN(CCN1CC(F)(F)C1)c1ccc(Nc2cc(NC3CC3)n3ncc(C#N)c3n2)cc1NC(C)=O
Show InChI InChI=1S/C24H27F2N9O/c1-15(36)29-19-9-18(5-6-20(19)33(2)7-8-34-13-24(25,26)14-34)30-21-10-22(31-17-3-4-17)35-23(32-21)16(11-27)12-28-35/h5-6,9-10,12,17,31H,3-4,7-8,13-14H2,1-2H3,(H,29,36)(H,30,32)
n/an/a 13n/an/an/an/an/an/a
AstraZeneca
Curated by ChEMBL
Assay Description
Inhibition of full length N-terminal 6xHis-tagged recombinant human CK2alpha expressed in fall armyworm Sf21 cells using BODIPY-FL-RRRDDDSDDD-CONH2 a...
ACS Med Chem Lett 7: 300-5 (2016)
BindingDB Entry DOI: 10.7270/Q2C53NRM