BDBM50172448 2-(2,4-Dichloro-phenoxy)-N-(4-methyl-2-piperidin-1-yl-quinolin-6-yl)-acetamide::CHEMBL366180
SMILES: Cc1cc(nc2ccc(NC(=O)COc3ccc(Cl)cc3Cl)cc12)N1CCCCC1
InChI Key: InChIKey=NKJCLKBBZCIYSJ-UHFFFAOYSA-N
Data: 1 IC50
Activity Spreadsheet -- Enzyme Inhibition Constant Data from BindingDB
Found 1 hit for monomerid = 50172448
Trg + Lig
Ki
nM
ΔG°
kcal/mole
IC50
nM
Kd
nM
EC50/IC50
nM
koff
s-1
kon
M-1s-1
pHTemp
°C
Melanin-concentrating hormone receptor
(Homo sapiens (Human))
BDBM50172448
(2-(2,4-Dichloro-phenoxy)-N-(4-methyl-2-piperidin-1...)
Show SMILES Cc1cc(nc2ccc(NC(=O)COc3ccc(Cl)cc3Cl)cc12)N1CCCCC1
Show InChI InChI=1S/C23H23Cl2N3O2/c1-15-11-22(28-9-3-2-4-10-28)27-20-7-6-17(13-18(15)20)26-23(29)14-30-21-8-5-16(24)12-19(21)25/h5-8,11-13H,2-4,9-10,14H2,1H3,(H,26,29)
Reactome pathway
n/an/a 82n/an/an/an/an/an/a
7TM Pharma A/S
Curated by ChEMBL
Assay Description
Displacement of 150p M [125I]-MCH from human MCH1R expressed in CHO-K1 cells
J Med Chem 48: 5684-97 (2005)
Article DOI: 10.1021/jm050103y
BindingDB Entry DOI: 10.7270/Q2H41QZ8