BDBM50172872 (S)-2-[3-(4-Benzyl-piperazin-1-yl)-propyl]-10,10a-dihydro-5H-imidazo[1,5-b]isoquinoline-1,3-dione::CHEMBL194967
SMILES: Oc1c2Cc3ccccc3Cn2c(=O)n1CCCN1CCN(Cc2ccccc2)CC1
InChI Key: InChIKey=HDWPIZDZENXVSZ-UHFFFAOYSA-N
Data: 1 IC50
Activity Spreadsheet -- Enzyme Inhibition Constant Data from BindingDB
Found 1 hit for monomerid = 50172872
Trg + Lig
Ki
nM
ΔG°
kcal/mole
IC50
nM
Kd
nM
EC50/IC50
nM
koff
s-1
kon
M-1s-1
pHTemp
°C
Sigma non-opioid intracellular receptor 1
(Homo sapiens (Human))
BDBM50172872
((S)-2-[3-(4-Benzyl-piperazin-1-yl)-propyl]-10,10a-...)
Show SMILES Oc1c2Cc3ccccc3Cn2c(=O)n1CCCN1CCN(Cc2ccccc2)CC1
Show InChI InChI=1S/C25H30N4O2/c30-24-23-17-21-9-4-5-10-22(21)19-29(23)25(31)28(24)12-6-11-26-13-15-27(16-14-26)18-20-7-2-1-3-8-20/h1-5,7-10,30H,6,11-19H2
n/an/a 32n/an/an/an/a7.5n/a
Université de Lille II
Curated by ChEMBL
Assay Description
Inhibitory activity against opioid receptor sigma 1 in guinea pig cerebral cortex using [3H]-(+)-pentazocine as radio ligand at pH 7.5 for 150 min at...
Bioorg Med Chem Lett 15: 4828-32 (2005)
Article DOI: 10.1016/j.bmcl.2005.07.039
BindingDB Entry DOI: 10.7270/Q2TD9WW1