BDBM50172888 (S)-2-{2-[Methyl-(3-phenyl-propyl)-amino]-ethyl}-10,10a-dihydro-5H-imidazo[1,5-b]isoquinoline-1,3-dione::CHEMBL193662
SMILES: CN(CCCc1ccccc1)CCn1c(O)c2Cc3ccccc3Cn2c1=O
InChI Key: InChIKey=KIAUOUHAQJBBEC-UHFFFAOYSA-N
Data: 1 IC50
Activity Spreadsheet -- Enzyme Inhibition Constant Data from BindingDB
Found 1 hit for monomerid = 50172888
Trg + Lig
Ki
nM
ΔG°
kcal/mole
IC50
nM
Kd
nM
EC50/IC50
nM
koff
s-1
kon
M-1s-1
pHTemp
°C
Sigma non-opioid intracellular receptor 1
(Homo sapiens (Human))
BDBM50172888
((S)-2-{2-[Methyl-(3-phenyl-propyl)-amino]-ethyl}-1...)
Show SMILES CN(CCCc1ccccc1)CCn1c(O)c2Cc3ccccc3Cn2c1=O
Show InChI InChI=1S/C23H27N3O2/c1-24(13-7-10-18-8-3-2-4-9-18)14-15-25-22(27)21-16-19-11-5-6-12-20(19)17-26(21)23(25)28/h2-6,8-9,11-12,27H,7,10,13-17H2,1H3
n/an/a 13.6n/an/an/an/a7.5n/a
Université de Lille II
Curated by ChEMBL
Assay Description
Inhibitory activity against opioid receptor sigma 1 in guinea pig cerebral cortex using [3H]-(+)-pentazocine as radio ligand at pH 7.5 for 150 min at...
Bioorg Med Chem Lett 15: 4828-32 (2005)
Article DOI: 10.1016/j.bmcl.2005.07.039
BindingDB Entry DOI: 10.7270/Q2TD9WW1