BDBM50172893 (S)-2-[5-(Methyl-phenethyl-amino)-pentyl]-10,10a-dihydro-5H-imidazo[1,5-b]isoquinoline-1,3-dione::CHEMBL195994
SMILES: CN(CCCCCn1c(O)c2Cc3ccccc3Cn2c1=O)CCc1ccccc1
InChI Key: InChIKey=NFURBBWBJDCEMW-UHFFFAOYSA-N
Data: 1 IC50
Activity Spreadsheet -- Enzyme Inhibition Constant Data from BindingDB
Found 1 hit for monomerid = 50172893
Trg + Lig
Ki
nM
ΔG°
kcal/mole
IC50
nM
Kd
nM
EC50/IC50
nM
koff
s-1
kon
M-1s-1
pHTemp
°C
Sigma non-opioid intracellular receptor 1
(Homo sapiens (Human))
BDBM50172893
((S)-2-[5-(Methyl-phenethyl-amino)-pentyl]-10,10a-d...)
Show SMILES CN(CCCCCn1c(O)c2Cc3ccccc3Cn2c1=O)CCc1ccccc1
Show InChI InChI=1S/C25H31N3O2/c1-26(17-14-20-10-4-2-5-11-20)15-8-3-9-16-27-24(29)23-18-21-12-6-7-13-22(21)19-28(23)25(27)30/h2,4-7,10-13,29H,3,8-9,14-19H2,1H3
n/an/a 11.7n/an/an/an/a7.5n/a
Université de Lille II
Curated by ChEMBL
Assay Description
Inhibitory activity against opioid receptor sigma 1 in guinea pig cerebral cortex using [3H]-(+)-pentazocine as radio ligand at pH 7.5 for 150 min at...
Bioorg Med Chem Lett 15: 4828-32 (2005)
Article DOI: 10.1016/j.bmcl.2005.07.039
BindingDB Entry DOI: 10.7270/Q2TD9WW1