BDBM50173045 4-(4-(4-tert-butylphenylamino)phthalazin-1-yl)-N-methylbenzamide::4-[4-(4-tert-Butyl-phenylamino)-phthalazin-1-yl]-N-methyl-benzamide::CHEMBL196609
SMILES: CNC(=O)c1ccc(cc1)-c1nnc(Nc2ccc(cc2)C(C)(C)C)c2ccccc12
InChI Key: InChIKey=CZXUSMYRTQIVIP-UHFFFAOYSA-N
Data: 2 IC50
Activity Spreadsheet -- Enzyme Inhibition Constant Data from BindingDB
Found 2 hits for monomerid = 50173045
Trg + Lig
Ki
nM
ΔG°
kcal/mole
IC50
nM
Kd
nM
EC50/IC50
nM
koff
s-1
kon
M-1s-1
pHTemp
°C
Vascular endothelial growth factor receptor 2
(Homo sapiens (Human))
BDBM50173045
(4-(4-(4-tert-butylphenylamino)phthalazin-1-yl)-N-m...)
Show SMILES CNC(=O)c1ccc(cc1)-c1nnc(Nc2ccc(cc2)C(C)(C)C)c2ccccc12
Show InChI InChI=1S/C26H26N4O/c1-26(2,3)19-13-15-20(16-14-19)28-24-22-8-6-5-7-21(22)23(29-30-24)17-9-11-18(12-10-17)25(31)27-4/h5-16H,1-4H3,(H,27,31)(H,28,30)
NCI pathway
Reactome pathway
n/an/a 130n/an/an/an/an/an/a
ImClone Systems, Inc.
Curated by ChEMBL
Assay Description
Inhibition of VEGFR2 (unknown origin) by HTRF method
Bioorg Med Chem 17: 731-40 (2009)
Article DOI: 10.1016/j.bmc.2008.11.049
BindingDB Entry DOI: 10.7270/Q2W95929
Vascular endothelial growth factor receptor 2
(Homo sapiens (Human))
BDBM50173045
(4-(4-(4-tert-butylphenylamino)phthalazin-1-yl)-N-m...)
Show SMILES CNC(=O)c1ccc(cc1)-c1nnc(Nc2ccc(cc2)C(C)(C)C)c2ccccc12
Show InChI InChI=1S/C26H26N4O/c1-26(2,3)19-13-15-20(16-14-19)28-24-22-8-6-5-7-21(22)23(29-30-24)17-9-11-18(12-10-17)25(31)27-4/h5-16H,1-4H3,(H,27,31)(H,28,30)
NCI pathway
Reactome pathway
n/an/a 130n/an/an/an/an/an/a
ImClone Systems
Curated by ChEMBL
Assay Description
Inhibition of Vascular endothelial growth factor receptor 2 kinase phosphorylation of pGAT-biotin peptide
Bioorg Med Chem Lett 15: 4696-8 (2005)
Article DOI: 10.1016/j.bmcl.2005.07.064
BindingDB Entry DOI: 10.7270/Q25Q4VNS