BDBM50173049 4-(4-(4-(chlorodifluoromethoxy)phenylamino)phthalazin-1-yl)benzamide::4-{4-[4-(Chloro-difluoro-methoxy)-phenylamino]-phthalazin-1-yl}-benzamide::CHEMBL193342::IM-023911
SMILES: NC(=O)c1ccc(cc1)-c1nnc(Nc2ccc(OC(F)(F)Cl)cc2)c2ccccc12
InChI Key: InChIKey=GUSAPNPQBHFHSX-UHFFFAOYSA-N
Data: 2 IC50
Activity Spreadsheet -- Enzyme Inhibition Constant Data from BindingDB
Found 2 hits for monomerid = 50173049
Trg + Lig
Ki
nM
ΔG°
kcal/mole
IC50
nM
Kd
nM
EC50/IC50
nM
koff
s-1
kon
M-1s-1
pHTemp
°C
Vascular endothelial growth factor receptor 2
(Homo sapiens (Human))
BDBM50173049
(4-(4-(4-(chlorodifluoromethoxy)phenylamino)phthala...)
Show SMILES NC(=O)c1ccc(cc1)-c1nnc(Nc2ccc(OC(F)(F)Cl)cc2)c2ccccc12
Show InChI InChI=1S/C22H15ClF2N4O2/c23-22(24,25)31-16-11-9-15(10-12-16)27-21-18-4-2-1-3-17(18)19(28-29-21)13-5-7-14(8-6-13)20(26)30/h1-12H,(H2,26,30)(H,27,29)
NCI pathway
Reactome pathway
n/an/a 190n/an/an/an/an/an/a
ImClone Systems, Inc.
Curated by ChEMBL
Assay Description
Inhibition of VEGFR2 (unknown origin) by HTRF method
Bioorg Med Chem 17: 731-40 (2009)
Article DOI: 10.1016/j.bmc.2008.11.049
BindingDB Entry DOI: 10.7270/Q2W95929
Vascular endothelial growth factor receptor 2
(Homo sapiens (Human))
BDBM50173049
(4-(4-(4-(chlorodifluoromethoxy)phenylamino)phthala...)
Show SMILES NC(=O)c1ccc(cc1)-c1nnc(Nc2ccc(OC(F)(F)Cl)cc2)c2ccccc12
Show InChI InChI=1S/C22H15ClF2N4O2/c23-22(24,25)31-16-11-9-15(10-12-16)27-21-18-4-2-1-3-17(18)19(28-29-21)13-5-7-14(8-6-13)20(26)30/h1-12H,(H2,26,30)(H,27,29)
NCI pathway
Reactome pathway
n/an/a 190n/an/an/an/an/an/a
ImClone Systems
Curated by ChEMBL
Assay Description
Inhibition of Vascular endothelial growth factor receptor 2 kinase phosphorylation of pGAT-biotin peptide
Bioorg Med Chem Lett 15: 4696-8 (2005)
Article DOI: 10.1016/j.bmcl.2005.07.064
BindingDB Entry DOI: 10.7270/Q25Q4VNS