null
SMILES: CN(C)C(=O)c1cccc(c1)-c1cn2nc(nc2c(N)n1)-c1ccco1
InChI Key: InChIKey=OFRANIBPBFPFGV-UHFFFAOYSA-N
Activity Spreadsheet -- Enzyme Inhibition Constant Data from BindingDB
Found 2 hits for monomerid = 50173177
Trg + Lig
Ki
nM
ΔG°
kcal/mole
IC50
nM
Kd
nM
EC50/IC50
nM
koff
s-1
kon
M-1s-1
pHTemp
°C
Adenosine receptor A2a
(Rattus norvegicus (rat))
BDBM50173177
(3-(8-Amino-2-furan-2-yl-[1,2,4]triazolo[1,5-a]pyra...)
Show SMILES CN(C)C(=O)c1cccc(c1)-c1cn2nc(nc2c(N)n1)-c1ccco1
Show InChI InChI=1S/C18H16N6O2/c1-23(2)18(25)12-6-3-5-11(9-12)13-10-24-17(15(19)20-13)21-16(22-24)14-7-4-8-26-14/h3-10H,1-2H3,(H2,19,20)
Reactome pathway
70n/an/an/an/an/an/an/an/a
Biogen Idec, Inc.
Curated by ChEMBL
Assay Description
Binding affinity towards adenosine A2a receptor of rat brain homogenates using [3H]-ZM-241,385 compared to SCH-58261 (Ki=37 nM)
Bioorg Med Chem Lett 15: 4809-13 (2005)
Article DOI: 10.1016/j.bmcl.2005.07.052
BindingDB Entry DOI: 10.7270/Q24Q7TJV
Adenosine receptor A1
(Rattus norvegicus (rat))
BDBM50173177
(3-(8-Amino-2-furan-2-yl-[1,2,4]triazolo[1,5-a]pyra...)
Show SMILES CN(C)C(=O)c1cccc(c1)-c1cn2nc(nc2c(N)n1)-c1ccco1
Show InChI InChI=1S/C18H16N6O2/c1-23(2)18(25)12-6-3-5-11(9-12)13-10-24-17(15(19)20-13)21-16(22-24)14-7-4-8-26-14/h3-10H,1-2H3,(H2,19,20)
Reactome pathway
120n/an/an/an/an/an/an/an/a
Biogen Idec, Inc.
Curated by ChEMBL
Assay Description
Binding affinity towards adenosine A1 receptor of rat cerebral cortex using [3H]-DPCPX compared to SCH-58261 (Ki=390 nM)
Bioorg Med Chem Lett 15: 4809-13 (2005)
Article DOI: 10.1016/j.bmcl.2005.07.052
BindingDB Entry DOI: 10.7270/Q24Q7TJV