BDBM50173182 8-Amino-2-furan-2-yl-[1,2,4]triazolo[1,5-a]pyrazine-6-carboxylic acid (3-phenyl-propyl)-amide::CHEMBL363647
SMILES: Nc1nc(cn2nc(nc12)-c1ccco1)C(=O)NCCCc1ccccc1
InChI Key: InChIKey=AMUVEDCWJWCWEX-UHFFFAOYSA-N
Data: 2 KI
Activity Spreadsheet -- Enzyme Inhibition Constant Data from BindingDB
Found 2 hits for monomerid = 50173182
Trg + Lig
Ki
nM
ΔG°
kcal/mole
IC50
nM
Kd
nM
EC50/IC50
nM
koff
s-1
kon
M-1s-1
pHTemp
°C
Adenosine Receptors A2a (A2a)
(Rattus norvegicus (rat))
BDBM50173182
(8-Amino-2-furan-2-yl-[1,2,4]triazolo[1,5-a]pyrazin...)
Show SMILES Nc1nc(cn2nc(nc12)-c1ccco1)C(=O)NCCCc1ccccc1
Show InChI InChI=1S/C19H18N6O2/c20-16-18-23-17(15-9-5-11-27-15)24-25(18)12-14(22-16)19(26)21-10-4-8-13-6-2-1-3-7-13/h1-3,5-7,9,11-12H,4,8,10H2,(H2,20,22)(H,21,26)
Reactome pathway
28n/an/an/an/an/an/an/an/a
Biogen Idec, Inc.
Curated by ChEMBL
Assay Description
Binding affinity towards adenosine A2a receptor of rat brain homogenates using [3H]-ZM-241,385 compared to SCH-58261 (Ki=37 nM)
Bioorg Med Chem Lett 15: 4809-13 (2005)
Article DOI: 10.1016/j.bmcl.2005.07.052
BindingDB Entry DOI: 10.7270/Q24Q7TJV
Adenosine receptor A1
(Rattus norvegicus (rat))
BDBM50173182
(8-Amino-2-furan-2-yl-[1,2,4]triazolo[1,5-a]pyrazin...)
Show SMILES Nc1nc(cn2nc(nc12)-c1ccco1)C(=O)NCCCc1ccccc1
Show InChI InChI=1S/C19H18N6O2/c20-16-18-23-17(15-9-5-11-27-15)24-25(18)12-14(22-16)19(26)21-10-4-8-13-6-2-1-3-7-13/h1-3,5-7,9,11-12H,4,8,10H2,(H2,20,22)(H,21,26)
Reactome pathway
240n/an/an/an/an/an/an/an/a
Biogen Idec, Inc.
Curated by ChEMBL
Assay Description
Binding affinity towards adenosine A1 receptor of rat cerebral cortex using [3H]-DPCPX compared to SCH-58261 (Ki=390 nM)
Bioorg Med Chem Lett 15: 4809-13 (2005)
Article DOI: 10.1016/j.bmcl.2005.07.052
BindingDB Entry DOI: 10.7270/Q24Q7TJV