BDBM50173192 4-(8-Amino-2-furan-2-yl-[1,2,4]triazolo[1,5-a]pyrazin-6-yl)-N-[2-(4-hydroxy-phenyl)-ethyl]-benzamide::CHEMBL196729
SMILES: Nc1nc(cn2nc(nc12)-c1ccco1)-c1ccc(cc1)C(=O)NCCc1ccc(O)cc1
InChI Key: InChIKey=HUYLASKTXVQSES-UHFFFAOYSA-N
Data: 2 KI
Activity Spreadsheet -- Enzyme Inhibition Constant Data from BindingDB
Found 2 hits for monomerid = 50173192
Trg + Lig
Ki
nM
ΔG°
kcal/mole
IC50
nM
Kd
nM
EC50/IC50
nM
koff
s-1
kon
M-1s-1
pHTemp
°C
Adenosine receptor A1
(Rattus norvegicus (rat))
BDBM50173192
(4-(8-Amino-2-furan-2-yl-[1,2,4]triazolo[1,5-a]pyra...)
Show SMILES Nc1nc(cn2nc(nc12)-c1ccco1)-c1ccc(cc1)C(=O)NCCc1ccc(O)cc1
Show InChI InChI=1S/C24H20N6O3/c25-21-23-28-22(20-2-1-13-33-20)29-30(23)14-19(27-21)16-5-7-17(8-6-16)24(32)26-12-11-15-3-9-18(31)10-4-15/h1-10,13-14,31H,11-12H2,(H2,25,27)(H,26,32)
Reactome pathway
36n/an/an/an/an/an/an/an/a
Biogen Idec, Inc.
Curated by ChEMBL
Assay Description
Binding affinity towards adenosine A1 receptor of rat cerebral cortex using [3H]-DPCPX compared to SCH-58261 (Ki=390 nM)
Bioorg Med Chem Lett 15: 4809-13 (2005)
Article DOI: 10.1016/j.bmcl.2005.07.052
BindingDB Entry DOI: 10.7270/Q24Q7TJV
Adenosine Receptors A2a (A2a)
(Rattus norvegicus (rat))
BDBM50173192
(4-(8-Amino-2-furan-2-yl-[1,2,4]triazolo[1,5-a]pyra...)
Show SMILES Nc1nc(cn2nc(nc12)-c1ccco1)-c1ccc(cc1)C(=O)NCCc1ccc(O)cc1
Show InChI InChI=1S/C24H20N6O3/c25-21-23-28-22(20-2-1-13-33-20)29-30(23)14-19(27-21)16-5-7-17(8-6-16)24(32)26-12-11-15-3-9-18(31)10-4-15/h1-10,13-14,31H,11-12H2,(H2,25,27)(H,26,32)
Reactome pathway
830n/an/an/an/an/an/an/an/a
Biogen Idec, Inc.
Curated by ChEMBL
Assay Description
Binding affinity towards adenosine A2a receptor of rat brain homogenates using [3H]-ZM-241,385 compared to SCH-58261 (Ki=37 nM)
Bioorg Med Chem Lett 15: 4809-13 (2005)
Article DOI: 10.1016/j.bmcl.2005.07.052
BindingDB Entry DOI: 10.7270/Q24Q7TJV