BDBM50173204 2-Furan-2-yl-6-(3-trifluoromethyl-phenyl)-[1,2,4]triazolo[1,5-a]pyrazin-8-ylamine::CHEMBL363646
SMILES: Nc1nc(cn2nc(nc12)-c1ccco1)-c1cccc(c1)C(F)(F)F
InChI Key: InChIKey=BONHMGPYMDNMSU-UHFFFAOYSA-N
Data: 1 KI
Activity Spreadsheet -- Enzyme Inhibition Constant Data from BindingDB
Found 1 hit for monomerid = 50173204
Trg + Lig
Ki
nM
ΔG°
kcal/mole
IC50
nM
Kd
nM
EC50/IC50
nM
koff
s-1
kon
M-1s-1
pHTemp
°C
Adenosine Receptors A2a (A2a)
(Rattus norvegicus (rat))
BDBM50173204
(2-Furan-2-yl-6-(3-trifluoromethyl-phenyl)-[1,2,4]t...)
Show SMILES Nc1nc(cn2nc(nc12)-c1ccco1)-c1cccc(c1)C(F)(F)F
Show InChI InChI=1S/C16H10F3N5O/c17-16(18,19)10-4-1-3-9(7-10)11-8-24-15(13(20)21-11)22-14(23-24)12-5-2-6-25-12/h1-8H,(H2,20,21)
Reactome pathway
220n/an/an/an/an/an/an/an/a
Biogen Idec, Inc.
Curated by ChEMBL
Assay Description
Binding affinity towards adenosine A2a receptor of rat brain homogenates using [3H]-ZM-241,385 compared to SCH-58261 (Ki=37 nM)
Bioorg Med Chem Lett 15: 4809-13 (2005)
Article DOI: 10.1016/j.bmcl.2005.07.052
BindingDB Entry DOI: 10.7270/Q24Q7TJV